{"text_format":"1","workbook":"xlsx","n_sheets":3,"sheets":["Lyo-cycle","Phase diagram","Data for phase diagram"],"not_rendered":{"charts":2,"images":0,"macros":1,"external_links":0,"defined_names":1,"comments":0,"pivot_tables":0},"unopened":[],"bounds":{"document_bytes":16777216,"sheet_cells":100000,"rows_first":2000,"rows_last":500,"rows_between":2000,"halvings":0,"cell_chars":16384,"cell_head_chars":4096},"cells_cut":0,"cells_raw":0,"read":"whole","date_system":"1900"}

{"sheet":"Lyo-cycle","index":0,"n_rows":78,"n_cols":32,"rows_kept":78,"cut":false,"hidden":false,"merged":[[7,16,7,17],[7,31,7,32]]}
[]
[null,null,"rate °C min−1","start T °C ","end T °C ","min"]
[null,"Ramp period calculator",0.5,0,40,{"$f":"ABS((E3-D3)/C3)","v":80}]
[]
[null,"Step","Temperature (°C)","Ramp (°C/min)","Time (min)","Cumulative Time (h)","Ramp (mbar/min)","Set pressure (mbar)"]
[null,"Equilibrium phase ",20,null,0,{"$f":"0/60","v":0},null,1000]
["A","Freezing ramp",-50,{"$f":"(C7-C6)/E7","v":-0.5},140,{"$f":"E7/60+F6","v":2.3333333333333335},null,1000,null,null,null,"period labels",null,null,null,null,null,null,null,null,null,null,null,null,null,null,"Vertical lines"]
["B","Freezing hold",-50,null,120,{"$f":"E8/60+F7","v":4.3333333333333339},null,1000,null,null,null,null,null,null,null,null,"period label",null,null,null,null,"time period label",null,null,null,null,null,null,null,null,null,"period vertical line"]
["C","Re-heating ramp ",-10,{"$f":"(C9-C8)/E9","v":0.5},80,5.666666666666667,null,1000,null,null,null,"periods",null,null,"label (min)",null,"data point","series label",null,null,null,null,null,null,null,null,"periods",null,null,"label (min)"]
["D","Annealing hold",-10,null,180,8.6666666666666679,null,1000,null,null,{"$f":"A7","v":"A"},{"$f":"IF(ISBLANK(B7),\" \",B7)","v":"Freezing ramp"},0,{"$f":"$C$30","v":40},{"$f":"IF(ISBLANK(E7),\" \",E7)","v":140},null,{"$f":"(M11-M10)/2","v":1.1666666666666667},{"$f":"$Q$8&\": \"&L10","v":"period label: Freezing ramp"},null,null,{"$f":"Q10","v":1.1666666666666667},{"$f":"$V$8&\": \"& O10","v":"time period label: 140"},null,{"$f":"TEXT(H13*1000,\"000\") & \" microbar\"","v":"400 microbar"},"m",{"$f":"A7","v":"A"},{"$f":"L10","v":"Freezing ramp"},{"$f":"M10","v":0},{"$f":"F29","v":0},{"$f":"TEXT(E7,0)&\" min\"","v":"140 min"},null,{"$f":"$AF$8&\": \"&AA10","v":"period vertical line: Freezing ramp"}]
["E","Re-cooling ramp ",-40,{"$f":"(C11-C10)/E11","v":-0.375},80,10.000000000000002,null,1000,null,null,null,null,{"$f":"F7","v":2.3333333333333335},{"$f":"$C$30","v":40},null,null,{"$f":"$C$29","v":45},null,null,null,{"$f":"$C$31","v":-55},null,null,null,null,null,null,{"$f":"M10","v":0},{"$f":"$F$30","v":4}]
["F","Re-cooling hold",-40,null,60,11.000000000000002,null,1000,null,null,{"$f":"A8","v":"B"},{"$f":"IF(ISBLANK(B8),\" \",B8)","v":"Freezing hold"},{"$f":"M11","v":2.3333333333333335},{"$f":"$C$30","v":40},{"$f":"IF(ISBLANK(E8),\" \",E8)","v":120},null,{"$f":"M11+(M13-M12)/2","v":3.3333333333333339},{"$f":"$Q$8&\": \"&L12","v":"period label: Freezing hold"},null,null,{"$f":"Q12","v":3.3333333333333339},{"$f":"$V$8&\": \"& O12","v":"time period label: 120"},null,null,null,{"$f":"A8","v":"B"},{"$f":"L12","v":"Freezing hold"},{"$f":"M12","v":2.3333333333333335},{"$f":"F29","v":0},{"$f":"TEXT(E8,0)&\" min\"","v":"120 min"},null,{"$f":"$AF$8&\": \"&AA12","v":"period vertical line: Freezing hold"}]
["G","Vacuum ramp",-40,null,1,11.016666666666669,999.6,0.4,null,null,null,null,{"$f":"F8","v":4.3333333333333339},{"$f":"$C$30","v":40},null,null,{"$f":"$C$29","v":45},null,null,null,{"$f":"$C$31","v":-55},null,null,null,null,null,null,{"$f":"M12","v":2.3333333333333335},{"$f":"$F$30","v":4}]
["H","Primary drying hold",-40,null,60,12.016666666666669,null,0.4,null,null,{"$f":"A9","v":"C"},{"$f":"IF(ISBLANK(B9),\" \",B9)","v":"Re-heating ramp "},{"$f":"M13","v":4.3333333333333339},{"$f":"$C$30","v":40},{"$f":"IF(ISBLANK(E9),\" \",E9)","v":80},null,{"$f":"M14+(M15-M14)/2","v":5},{"$f":"$Q$8&\": \"&L14","v":"period label: Re-heating ramp "},null,null,{"$f":"Q14","v":5},{"$f":"$V$8&\": \"& O14","v":"time period label: 80"},null,null,null,{"$f":"A9","v":"C"},{"$f":"L14","v":"Re-heating ramp "},{"$f":"M14","v":4.3333333333333339},{"$f":"F29","v":0},{"$f":"TEXT(E9,0)&\" min\"","v":"80 min"},null,{"$f":"$AF$8&\": \"&AA14","v":"period vertical line: Re-heating ramp "}]
["I","Primary drying ramp ",10,{"$f":"(C15-C14)/E15","v":0.5},100,13.683333333333335,null,0.4,null,null,null,null,{"$f":"F9","v":5.666666666666667},{"$f":"$C$30","v":40},null,null,{"$f":"$C$29","v":45},null,null,null,{"$f":"$C$31","v":-55},null,null,null,null,null,null,{"$f":"M14","v":4.3333333333333339},{"$f":"$F$30","v":4}]
["J","Primary drying hold",10,null,720,25.683333333333337,null,0.4,null,null,{"$f":"A10","v":"D"},{"$f":"IF(ISBLANK(B10),\" \",B10)","v":"Annealing hold"},{"$f":"M15","v":5.666666666666667},{"$f":"$C$30","v":40},{"$f":"IF(ISBLANK(E10),\" \",E10)","v":180},null,{"$f":"M16+(M17-M16)/2","v":7.1666666666666679},{"$f":"$Q$8&\": \"&L16","v":"period label: Annealing hold"},null,null,{"$f":"Q16","v":7.1666666666666679},{"$f":"$V$8&\": \"& O16","v":"time period label: 180"},null,null,null,{"$f":"A10","v":"D"},{"$f":"L16","v":"Annealing hold"},{"$f":"M16","v":5.666666666666667},{"$f":"F29","v":0},{"$f":"TEXT(E10,0)&\" min\"","v":"180 min"},null,{"$f":"$AF$8&\": \"&AA16","v":"period vertical line: Annealing hold"}]
["K","secondary drying ramp",20,null,360,31.683333333333337,null,0.4,null,null,null,null,{"$f":"F10","v":8.6666666666666679},{"$f":"$C$30","v":40},null,null,{"$f":"$C$29","v":45},null,null,null,{"$f":"$C$31","v":-55},null,null,null,null,null,null,{"$f":"M16","v":5.666666666666667},{"$f":"$F$30","v":4}]
["L",null,null,null,null,31.683333333333337,null,null,null,null,{"$f":"A11","v":"E"},{"$f":"IF(ISBLANK(B11),\" \",B11)","v":"Re-cooling ramp "},{"$f":"M17","v":8.6666666666666679},{"$f":"$C$30","v":40},{"$f":"IF(ISBLANK(E11),\" \",E11)","v":80},null,{"$f":"M18+(M19-M18)/2","v":9.3333333333333357},{"$f":"$Q$8&\": \"&L18","v":"period label: Re-cooling ramp "},null,null,{"$f":"Q18","v":9.3333333333333357},{"$f":"$V$8&\": \"& O18","v":"time period label: 80"},null,null,null,{"$f":"A11","v":"E"},{"$f":"L18","v":"Re-cooling ramp "},{"$f":"M18","v":8.6666666666666679},{"$f":"F29","v":0},{"$f":"TEXT(E11,0)&\" min\"","v":"80 min"},null,{"$f":"$AF$8&\": \"&AA18","v":"period vertical line: Re-cooling ramp "}]
["M",null,null,null,null,31.683333333333337,null,null,null,null,null,null,{"$f":"F11","v":10.000000000000002},{"$f":"$C$30","v":40},null,null,{"$f":"$C$29","v":45},null,null,null,{"$f":"$C$31","v":-55},null,null,null,null,null,null,{"$f":"M18","v":8.6666666666666679},{"$f":"$F$30","v":4}]
["N",null,null,null,null,31.683333333333337,null,null,null,null,{"$f":"A12","v":"F"},{"$f":"IF(ISBLANK(B12),\" \",B12)","v":"Re-cooling hold"},{"$f":"M19","v":10.000000000000002},{"$f":"$C$30","v":40},{"$f":"IF(ISBLANK(E12),\" \",E12)","v":60},null,{"$f":"M20+(M21-M20)/2","v":10.500000000000002},{"$f":"$Q$8&\": \"&L20","v":"period label: Re-cooling hold"},null,null,{"$f":"Q20","v":10.500000000000002},{"$f":"$V$8&\": \"& O20","v":"time period label: 60"},null,null,null,{"$f":"A12","v":"F"},{"$f":"L20","v":"Re-cooling hold"},{"$f":"M20","v":10.000000000000002},{"$f":"F29","v":0},{"$f":"TEXT(E12,0)&\" min\"","v":"60 min"},null,{"$f":"$AF$8&\": \"&AA20","v":"period vertical line: Re-cooling hold"}]
{"$rows_left_out":59}
{"sheet":"Phase diagram","index":1,"n_rows":41,"n_cols":24,"rows_kept":41,"cut":false,"hidden":false,"merged":[[25,18,25,21]]}
[null,null,null,null,null,null,null,null,null,null,null,null,null,"Ambient conditions"]
["Lyo cycle (live)",null,null,null,null,null,"Graph in the format suitable for book chapter or manuscript",null,null,null,null,null,null,"Room temperature",20," °C",null,null,null,null,null,{"$f":"N2&\" \"&TEXT(O2,\"0\")&\" \"&P2","v":"Room temperature 20  °C"}]
["t (start)",0,"min",null,null,null,null,null,null,null,null,null,null,"Formulation parameters"]
["dt",10,"min",null,null,null,null,null,null,null,null,null,null,"Glass transiton temperature",-34," °C",null,null,null,null,null,{"$f":"N4&\" \"&TEXT(O4,\"0\")&\" \"&P4","v":"Glass transiton temperature -34  °C"}]
["time (t- dt)",140,"min",null,null,null,null,null,null,null,null,null,null,"Eutectic temperature",-15," °C",null,null,null,null,null,{"$f":"N5&\" \"&TEXT(O5,\"0\")&\" \"&P5","v":"Eutectic temperature -15  °C"}]
["time (t)",140,"min",null,null,null,null,null,null,null,null,null,null,"Collapse temperature",-32," °C",null,null,null,null,null,{"$f":"N6&\" \"&TEXT(O6,\"0\")&\" \"&P6","v":"Collapse temperature -32  °C"}]
["Ts (0)",20," °C",null,null,null,null,null,null,null,null,null,null,"Process parameters"]
["rate",-0.5,null,null,null,null,null,null,null,null,null,null,null,"Nucleation temperature",-12," °C",null,null,null,"log chamber pressure",{"$f":"VLOOKUP(O8,'Data for phase diagram'!B7:J237,9,FALSE)","v":-2.6629003036383168},{"$f":"N8&\" \"&TEXT(O8,\"0\")&P8","v":"Nucleation temperature -12 °C"}]
["dT",{"$f":"B8*B4","v":-5}," °C"]
["Ts (t - dt)",-50," °C",null,null,null,null,null,null,null,null,null,null,null,"set temperature",null,"heating/cooling rate (°C min-1)","ramp/hold (min)","set pressure (chamber, µbar)","set pressure (chamber, bar)","log chamber pressure/bar"]
["Ts (t)",-50," °C",null,null,null,null,null,null,null,null,null,null,"Set parameters"]
["Pc (bar)",0,"bar",null,null,null,null,null,null,null,null,null,null,"Set point (Equilibration) Shelf temperature",{"$f":"'Lyo-cycle'!C6","v":20}," °C",null,null,null,1,{"$f":"LOG(T12)","v":0},{"$f":"\"Ts = \"&O12&P12","v":"Ts = 20 °C"},"Ts",{"$f":"TEXT(W12,0)","v":"Ts"}]
[null,null,null,null,null,null,null,null,null,null,null,null,null,"Set point (freezing) Shelf temperature",{"$f":"'Lyo-cycle'!C7","v":-50}," °C",0.5,{"$f":"(O13-O12)/Q13","v":-140},null,1,{"$f":"LOG(T13)","v":0},{"$f":"\"Ts = \"&O13&P13","v":"Ts = -50 °C"}]
[null,null,null,null,null,null,null,null,null,null,null,null,null,"Set point (primary drying) chamber vacuum",{"$f":"'Lyo-cycle'!C8","v":-50}," °C",0,null,{"$f":"'Lyo-cycle'!H13*1000","v":400},{"$f":"S14/1000000","v":4.0000000000000002E-4},{"$f":"LOG(T14)","v":-3.3979400086720375},"Ts = -50 °C"]
[null,null,null,null,null,null,null,null,null,null,null,null,null,"Set point (primary drying) shelf temperature",{"$f":"'Lyo-cycle'!C15","v":10}," °C",0.5,{"$f":"(O15-O14)/Q15","v":120},{"$f":"S14","v":400},{"$f":"S15/1000000","v":4.0000000000000002E-4},{"$f":"LOG(T15)","v":-3.3979400086720375},"Ts = 10 °C"]
[null,null,null,null,null,null,null,null,null,null,null,null,null,"Set point (secondary drying) shelf temperature",20," °C",0.5,{"$f":"(O16-O15)/Q16","v":20},null,null,null,"Ts = 20 °C"]
[]
[null,null,null,null,null,null,null,null,null,null,null,null,null,"Set point (primary drying) condensor temperature",-80," °C"]
[]
[null,null,null,null,null,null,null,null,null,null,null,null,null,"The ramp time is the time for the system to reach the set temperature"]
{"$rows_left_out":22}
{"sheet":"Data for phase diagram","index":2,"n_rows":237,"n_cols":28,"rows_kept":237,"cut":false,"hidden":false,"merged":[[1,1,1,5],[0,1,0,10],[1,11,1,15],[1,17,1,21]]}
[null,"Vapour pressure of Liquid water and ice as a function of temp"]
[null,"Vapour Pressure of Liquid Water from 0°C to 373°C",null,null,null,null,null,null,null,null,null,"Melting Point Line 0°C to 40°C",null,null,null,null,null,"Temp/Pressure at 1 ATM"]
[null,"Temp C","Temp K",null,"Pressure HPa","Pressure Torr/mmHG","Ln Pressure Torr/mmHG","Pressure in BAR","LN Pressure in bar","Log Pressure in Bar",null,"Temp C","Temp K","Pressure by formula Torr","Ln Pressure by formula Torr","Log Pressure by formula Torr",null,"Temp C","Temp K","Pressure in PA","Pressure in Torr","Pressure in Ln Torr","Pressure in Bar","LN Pressure in Bar","Log Pressure in Bar"]
[]
[]
[]
[null,-80,{"$f":"B7+273.15","v":193.14999999999998},{"$f":"C7-273.2","v":-80.050000000000011},5.5E-2,{"$f":"E7*0.0075006168270417","v":4.1253392548729349E-4},{"$f":"LN(F7)","v":-7.7931921119657988},{"$f":"E7*0.00001","v":5.5000000000000003E-7},{"$f":"LN(H7)","v":-14.413347558719895},{"$f":"LOG(H7)","v":-6.2596373105057559},null,0,{"$f":"L7+273.15","v":273.14999999999998},{"$f":"EXP(20.386-(5132/M7))","v":4.942090375617866},{"$f":"LN(N7)","v":1.5977883946549483},{"$f":"LOG(N7)","v":0.69391068304769921},null,0,{"$f":"R7+273.15","v":273.14999999999998},101325,{"$f":"T7*0.0075006168270417","v":760.00000000000023},{"$f":"LN(U7)","v":6.633318433280377},{"$f":"T7*0.00001","v":1.01325},{"$f":"LN(W7)","v":1.3162986526280862E-2},{"$f":"LOG(W7)","v":5.7166124137306316E-3}]
[null,-75,198.14999999999998,-75.050000000000011,0.122,9.1507525289908731E-4,-6.9965042524650132,1.2200000000000002E-6,-13.61665969921911,-5.9136401693252516,null,-0.5,{"$f":"L8+273.15","v":272.64999999999998},{"$f":"EXP(20.386-(5132/M8))","v":4.7747116173997481},{"$f":"LN(N8)","v":1.5633335778470538},{"$f":"LOG(N8)","v":0.67894714623304331},null,0.01,{"$f":"R8+273.15","v":273.15999999999997},611.65700000000004,{"$f":"T8*0.0075006168270417","v":4.5878047865778449},{"$f":"LN(U8)","v":1.5234016496648333},{"$f":"T8*0.00001","v":6.1165700000000009E-3},{"$f":"LN(W8)","v":-5.0967537970892627},{"$f":"LOG(W8)","v":-2.2134920496953128}]
[null,-70,203.14999999999998,-70.050000000000011,0.26100000000000001,1.9576609918578835E-3,-6.2360048898755762,2.6100000000000004E-6,-12.856160336629673,-5.5833594926617192,null,-1,272.14999999999998,4.612417664700974,1.5287521587359905,0.66392862673672481]
[null,-65,208.14999999999998,-65.050000000000011,0.54,4.0503330866025183E-3,-5.5089561576399495,5.4000000000000008E-6,-12.129111604394046,-5.2676062401770318,null,-1.5,271.64999999999998,4.4550729615802007,1.4940434382477434,0.64885482095475677]
[null,-60,213.14999999999998,-60.050000000000011,1.08,8.1006661732050365E-3,-4.8158089770800041,1.0800000000000002E-5,-11.435964423834101,-4.9665762445130506,null,-2,271.14999999999998,4.3025450175011875,1.4592067121519428,0.63372542304377544,null,"Melting Curve using Simon-Glatzel equation 0°C to -80°C",null,null,null,null,"Melting curve from wiki plot"]
[null,-55,218.14999999999998,-55.050000000000011,2.093,1.5698791018998279E-2,-4.1541715747522696,2.0930000000000001E-5,-10.774327021506366,-4.6792307716613131,null,-2.5,270.64999999999998,4.1547043519656759,1.4242412710142212,0.61854012490035004,null,"Temp K","Pressure (Gpa)","Pressure bar","Log Pressure in bar",null,"Temp in Kelvin",null,"Pressure in MPA","Pressue in Bar","Log Pressure in Bar","LN Pressure in basr"]
[null,-50,223.14999999999998,-50.050000000000011,3.9359999999999999,2.9522427831236129E-2,-3.5226050390261254,3.9360000000000003E-5,-10.14276048578022,-4.4049449102406957,null,-3,270.14999999999998,4.0114244398428625,1.3891464001480642,0.60329861614007096,null,273.14999999999998,{"$f":"(2.17+1.253*(R13/354.8)^3-1)","v":1.7417469441256754},{"$f":"S13*10000","v":17417.469441256755},{"$f":"LOG(T13)","v":4.2409850572427654},null,273.14999999999998,{"$f":"W13-273.2","v":-5.0000000000011369E-2},{"$f":"101325*0.000001","v":0.101325},{"$f":"Y13*10","v":1.01325},{"$f":"LOG(Z13)","v":5.7166124137306316E-3},{"$f":"LN(Z13)","v":1.3162986526280862E-2}]
[null,-45,228.14999999999998,-45.050000000000011,7.202,5.4019442388354322E-2,-2.9184112529894488,7.2020000000000005E-5,-9.5385666997435443,-4.1425468829647336,null,-3.5,269.64999999999998,3.8725816573919905,1.3539213795661027,0.58800058407639655,null,272.64999999999998,{"$f":"(2.17+1.253*(R14/354.8)^3-1)","v":1.7386129463102895},{"$f":"S14*10000","v":17386.129463102894},{"$f":"LOG(T14)","v":4.240202909207361},null,273.16000000000003,{"$f":"W14-273.2","v":-3.999999999996362E-2},{"$f":"611.657*0.000001","v":6.1165700000000004E-4},{"$f":"Y14*10","v":6.11657E-3},-2.2134920496953128,-5.0967537970892627]
[null,-40,233.14999999999998,-40.050000000000011,12.84,9.6307920059215429E-2,-2.340204719954317,1.284E-4,-8.9603601667084138,-3.8914349762671656,null,-4,269.14999999999998,3.7380552289749245,1.3185654839308896,0.57264571369927619,null,272.14999999999998,1.7354904220233993,17354.904220233992,4.2394222211916057,null,272.89999999999998,-0.30000000000001137,5,{"$f":"Y15*10","v":50},1.6989700043360187,3.912023005428146]
[null,-39.5,233.64999999999998,-39.550000000000011,13.59,0.1019333826794967,-2.2834357900530797,1.359E-4,-8.9035912368071752,-3.8667805432675055,null,-4.5,268.64999999999998,3.6077271744551198,1.283077982505116,0.55723368765352899,null,271.64999999999998,1.7323793502242406,17323.793502242406,4.2386429983450862,null,272.44,-0.75999999999999091,10,100,2,4.6051701859880918]
[null,-39,234.14999999999998,-39.050000000000011,14.37,0.10778386380458922,-2.2276273181251987,1.437E-4,-8.8477827648792946,-3.8425432318657742,null,-5,268.14999999999998,3.4814822572794886,1.2474581391012478,0.54176418621697109,null,271.14999999999998,1.7292797098720505,17292.797098720504,4.2378652458066393,null,271.74,-1.4599999999999795,20,200,2.3010299956639813,5.2983173665480363]
[null,-38.5,234.64999999999998,-38.550000000000011,15.2,0.11400937577103383,-2.1714745903639017,1.5200000000000001E-4,-8.7916300371179972,-3.8181564120552274,null,-5.5,267.64999999999998,3.3592079332398175,1.2117052120306333,0.52623688727831386,null,270.64999999999998,1.7261914799260643,17261.914799260641,4.2370889687041471,null,269.18,-4.0199999999999818,50,500,2.6989700043360187,6.2146080984221914]
[null,-38,235.14999999999998,-38.050000000000011,16.07,0.12053491241056012,-2.1158158384667112,1.607E-4,-8.735971285220808,-3.7939841232366556,null,-6,267.14999999999998,3.2407942999099451,1.1758184540520276,0.51065146631480784,null,270.14999999999998,1.723114639345519,17231.14639345519,4.2363141721543265,null,264.52999999999997,-8.6700000000000159,100,1000,3,6.9077552789821368]
[null,-37.5,235.64999999999998,-37.550000000000011,16.989999999999998,0.12743547989143847,-2.0601450825322916,1.6990000000000001E-4,-8.680300529286388,-3.7698066211309542,null,-6.5,266.64999999999998,3.1261340467550087,1.139797112319517,0.4950075963696271,null,269.64999999999998,1.7200491670896501,17200.491670896499,4.2355408612625132,null,258.95,-14.25,150,1500,3.1760912590556813,7.3132203870903014]
{"$rows_left_out":217}