{"text_format":"1","workbook":"xlsx","n_sheets":3,"sheets":["Lyo-cycle","Phase diagram","Data for phase diagram"],"not_rendered":{"charts":2,"images":0,"macros":1,"external_links":0,"defined_names":1,"comments":0,"pivot_tables":0},"unopened":[],"bounds":{"document_bytes":16777216,"sheet_cells":100000,"rows_first":2000,"rows_last":500,"rows_between":2000,"halvings":0,"cell_chars":16384,"cell_head_chars":4096},"cells_cut":0,"cells_raw":0,"read":"whole","date_system":"1900"}

{"sheet":"Lyo-cycle","index":0,"n_rows":78,"n_cols":32,"rows_kept":78,"cut":false,"hidden":false,"merged":[[7,16,7,17],[7,31,7,32]]}
[]
[null,null,"rate °C min−1","start T °C ","end T °C ","min"]
[null,"Ramp period calculator",0.5,0,40,{"$f":"ABS((E3-D3)/C3)","v":80}]
[]
[null,"Step","Temperature (°C)","Ramp (°C/min)","Time (min)","Cumulative Time (h)","Ramp (mbar/min)","Set pressure (mbar)"]
[null,"Equilibrium phase ",20,null,0,{"$f":"0/60","v":0},null,1000]
["A","Freezing ramp",-50,{"$f":"(C7-C6)/E7","v":-0.5},140,{"$f":"E7/60+F6","v":2.3333333333333335},null,1000,null,null,null,"period labels",null,null,null,null,null,null,null,null,null,null,null,null,null,null,"Vertical lines"]
["B","Freezing hold",-50,null,120,{"$f":"E8/60+F7","v":4.3333333333333339},null,1000,null,null,null,null,null,null,null,null,"period label",null,null,null,null,"time period label",null,null,null,null,null,null,null,null,null,"period vertical line"]
["C","Re-heating ramp ",-10,{"$f":"(C9-C8)/E9","v":0.5},80,5.666666666666667,null,1000,null,null,null,"periods",null,null,"label (min)",null,"data point","series label",null,null,null,null,null,null,null,null,"periods",null,null,"label (min)"]
["D","Annealing hold",-10,null,180,8.6666666666666679,null,1000,null,null,{"$f":"A7","v":"A"},{"$f":"IF(ISBLANK(B7),\" \",B7)","v":"Freezing ramp"},0,{"$f":"$C$30","v":40},{"$f":"IF(ISBLANK(E7),\" \",E7)","v":140},null,{"$f":"(M11-M10)/2","v":1.1666666666666667},{"$f":"$Q$8&\": \"&L10","v":"period label: Freezing ramp"},null,null,{"$f":"Q10","v":1.1666666666666667},{"$f":"$V$8&\": \"& O10","v":"time period label: 140"},null,{"$f":"TEXT(H13*1000,\"000\") & \" microbar\"","v":"400 microbar"},"m",{"$f":"A7","v":"A"},{"$f":"L10","v":"Freezing ramp"},{"$f":"M10","v":0},{"$f":"F29","v":0},{"$f":"TEXT(E7,0)&\" min\"","v":"140 min"},null,{"$f":"$AF$8&\": \"&AA10","v":"period vertical line: Freezing ramp"}]
["E","Re-cooling ramp ",-40,{"$f":"(C11-C10)/E11","v":-0.375},80,10.000000000000002,null,1000,null,null,null,null,{"$f":"F7","v":2.3333333333333335},{"$f":"$C$30","v":40},null,null,{"$f":"$C$29","v":45},null,null,null,{"$f":"$C$31","v":-55},null,null,null,null,null,null,{"$f":"M10","v":0},{"$f":"$F$30","v":4}]
["F","Re-cooling hold",-40,null,60,11.000000000000002,null,1000,null,null,{"$f":"A8","v":"B"},{"$f":"IF(ISBLANK(B8),\" \",B8)","v":"Freezing hold"},{"$f":"M11","v":2.3333333333333335},{"$f":"$C$30","v":40},{"$f":"IF(ISBLANK(E8),\" \",E8)","v":120},null,{"$f":"M11+(M13-M12)/2","v":3.3333333333333339},{"$f":"$Q$8&\": \"&L12","v":"period label: Freezing hold"},null,null,{"$f":"Q12","v":3.3333333333333339},{"$f":"$V$8&\": \"& O12","v":"time period label: 120"},null,null,null,{"$f":"A8","v":"B"},{"$f":"L12","v":"Freezing hold"},{"$f":"M12","v":2.3333333333333335},{"$f":"F29","v":0},{"$f":"TEXT(E8,0)&\" min\"","v":"120 min"},null,{"$f":"$AF$8&\": \"&AA12","v":"period vertical line: Freezing hold"}]
["G","Vacuum ramp",-40,null,1,11.016666666666669,999.6,0.4,null,null,null,null,{"$f":"F8","v":4.3333333333333339},{"$f":"$C$30","v":40},null,null,{"$f":"$C$29","v":45},null,null,null,{"$f":"$C$31","v":-55},null,null,null,null,null,null,{"$f":"M12","v":2.3333333333333335},{"$f":"$F$30","v":4}]
["H","Primary drying hold",-40,null,60,12.016666666666669,null,0.4,null,null,{"$f":"A9","v":"C"},{"$f":"IF(ISBLANK(B9),\" \",B9)","v":"Re-heating ramp "},{"$f":"M13","v":4.3333333333333339},{"$f":"$C$30","v":40},{"$f":"IF(ISBLANK(E9),\" \",E9)","v":80},null,{"$f":"M14+(M15-M14)/2","v":5},{"$f":"$Q$8&\": \"&L14","v":"period label: Re-heating ramp "},null,null,{"$f":"Q14","v":5},{"$f":"$V$8&\": \"& O14","v":"time period label: 80"},null,null,null,{"$f":"A9","v":"C"},{"$f":"L14","v":"Re-heating ramp "},{"$f":"M14","v":4.3333333333333339},{"$f":"F29","v":0},{"$f":"TEXT(E9,0)&\" min\"","v":"80 min"},null,{"$f":"$AF$8&\": \"&AA14","v":"period vertical line: Re-heating ramp "}]
["I","Primary drying ramp ",10,{"$f":"(C15-C14)/E15","v":0.5},100,13.683333333333335,null,0.4,null,null,null,null,{"$f":"F9","v":5.666666666666667},{"$f":"$C$30","v":40},null,null,{"$f":"$C$29","v":45},null,null,null,{"$f":"$C$31","v":-55},null,null,null,null,null,null,{"$f":"M14","v":4.3333333333333339},{"$f":"$F$30","v":4}]
["J","Primary drying hold",10,null,720,25.683333333333337,null,0.4,null,null,{"$f":"A10","v":"D"},{"$f":"IF(ISBLANK(B10),\" \",B10)","v":"Annealing hold"},{"$f":"M15","v":5.666666666666667},{"$f":"$C$30","v":40},{"$f":"IF(ISBLANK(E10),\" \",E10)","v":180},null,{"$f":"M16+(M17-M16)/2","v":7.1666666666666679},{"$f":"$Q$8&\": \"&L16","v":"period label: Annealing hold"},null,null,{"$f":"Q16","v":7.1666666666666679},{"$f":"$V$8&\": \"& O16","v":"time period label: 180"},null,null,null,{"$f":"A10","v":"D"},{"$f":"L16","v":"Annealing hold"},{"$f":"M16","v":5.666666666666667},{"$f":"F29","v":0},{"$f":"TEXT(E10,0)&\" min\"","v":"180 min"},null,{"$f":"$AF$8&\": \"&AA16","v":"period vertical line: Annealing hold"}]
["K","secondary drying ramp",20,null,360,31.683333333333337,null,0.4,null,null,null,null,{"$f":"F10","v":8.6666666666666679},{"$f":"$C$30","v":40},null,null,{"$f":"$C$29","v":45},null,null,null,{"$f":"$C$31","v":-55},null,null,null,null,null,null,{"$f":"M16","v":5.666666666666667},{"$f":"$F$30","v":4}]
["L",null,null,null,null,31.683333333333337,null,null,null,null,{"$f":"A11","v":"E"},{"$f":"IF(ISBLANK(B11),\" \",B11)","v":"Re-cooling ramp "},{"$f":"M17","v":8.6666666666666679},{"$f":"$C$30","v":40},{"$f":"IF(ISBLANK(E11),\" \",E11)","v":80},null,{"$f":"M18+(M19-M18)/2","v":9.3333333333333357},{"$f":"$Q$8&\": \"&L18","v":"period label: Re-cooling ramp "},null,null,{"$f":"Q18","v":9.3333333333333357},{"$f":"$V$8&\": \"& O18","v":"time period label: 80"},null,null,null,{"$f":"A11","v":"E"},{"$f":"L18","v":"Re-cooling ramp "},{"$f":"M18","v":8.6666666666666679},{"$f":"F29","v":0},{"$f":"TEXT(E11,0)&\" min\"","v":"80 min"},null,{"$f":"$AF$8&\": \"&AA18","v":"period vertical line: Re-cooling ramp "}]
["M",null,null,null,null,31.683333333333337,null,null,null,null,null,null,{"$f":"F11","v":10.000000000000002},{"$f":"$C$30","v":40},null,null,{"$f":"$C$29","v":45},null,null,null,{"$f":"$C$31","v":-55},null,null,null,null,null,null,{"$f":"M18","v":8.6666666666666679},{"$f":"$F$30","v":4}]
["N",null,null,null,null,31.683333333333337,null,null,null,null,{"$f":"A12","v":"F"},{"$f":"IF(ISBLANK(B12),\" \",B12)","v":"Re-cooling hold"},{"$f":"M19","v":10.000000000000002},{"$f":"$C$30","v":40},{"$f":"IF(ISBLANK(E12),\" \",E12)","v":60},null,{"$f":"M20+(M21-M20)/2","v":10.500000000000002},{"$f":"$Q$8&\": \"&L20","v":"period label: Re-cooling hold"},null,null,{"$f":"Q20","v":10.500000000000002},{"$f":"$V$8&\": \"& O20","v":"time period label: 60"},null,null,null,{"$f":"A12","v":"F"},{"$f":"L20","v":"Re-cooling hold"},{"$f":"M20","v":10.000000000000002},{"$f":"F29","v":0},{"$f":"TEXT(E12,0)&\" min\"","v":"60 min"},null,{"$f":"$AF$8&\": \"&AA20","v":"period vertical line: Re-cooling hold"}]
["O",null,null,null,null,31.683333333333337,null,null,null,null,null,null,{"$f":"F12","v":11.000000000000002},{"$f":"$C$30","v":40},null,null,{"$f":"$C$29","v":45},null,null,null,{"$f":"$C$31","v":-55},null,null,null,null,null,null,{"$f":"M20","v":10.000000000000002},{"$f":"$F$30","v":4}]
["P",null,null,null,null,31.683333333333337,null,null,null,null,{"$f":"A13","v":"G"},{"$f":"IF(ISBLANK(B13),\" \",B13)","v":"Vacuum ramp"},{"$f":"M21","v":11.000000000000002},{"$f":"$C$30","v":40},{"$f":"IF(ISBLANK(E13),\" \",E13)","v":1},null,{"$f":"M22+(M23-M22)/2","v":11.008333333333336},{"$f":"$Q$8&\": \"&L22","v":"period label: Vacuum ramp"},null,null,{"$f":"Q22","v":11.008333333333336},{"$f":"$V$8&\": \"& O22","v":"time period label: 1"},null,null,null,{"$f":"A13","v":"G"},{"$f":"L22","v":"Vacuum ramp"},{"$f":"M22","v":11.000000000000002},{"$f":"F59","v":0},{"$f":"TEXT(E13,0)&\" min\"","v":"1 min"},null,{"$f":"$AF$8&\": \"&AA22","v":"period vertical line: Vacuum ramp"}]
["Q",null,null,null,null,31.683333333333337,null,null,null,null,null,null,{"$f":"F13","v":11.016666666666669},{"$f":"$C$30","v":40},null,null,{"$f":"$C$29","v":45},null,null,null,{"$f":"$C$31","v":-55},null,null,null,null,null,null,{"$f":"M22","v":11.000000000000002},{"$f":"$F$30","v":4}]
["R",null,null,null,null,31.683333333333337,null,null,null,null,{"$f":"A14","v":"H"},{"$f":"IF(ISBLANK(B14),\" \",B14)","v":"Primary drying hold"},{"$f":"M23","v":11.016666666666669},{"$f":"$C$30","v":40},{"$f":"IF(ISBLANK(E14),\" \",E14)","v":60},null,{"$f":"M24+(M25-M24)/2","v":11.516666666666669},{"$f":"$Q$8&\": \"&L24","v":"period label: Primary drying hold"},null,null,{"$f":"Q24","v":11.516666666666669},{"$f":"$V$8&\": \"& O24","v":"time period label: 60"},null,null,null,{"$f":"A14","v":"H"},{"$f":"L24","v":"Primary drying hold"},{"$f":"M24","v":11.016666666666669},{"$f":"F61","v":0},{"$f":"TEXT(E14,0)&\" min\"","v":"60 min"},null,{"$f":"$AF$8&\": \"&AA24","v":"period vertical line: Primary drying hold"}]
["S",null,null,null,null,31.683333333333337,null,null,null,null,null,null,{"$f":"F14","v":12.016666666666669},{"$f":"$C$30","v":40},null,null,{"$f":"$C$29","v":45},null,null,null,{"$f":"$C$31","v":-55},null,null,null,null,null,null,{"$f":"M24","v":11.016666666666669},{"$f":"$F$30","v":4}]
["T",null,null,null,null,31.683333333333337,null,null,null,null,{"$f":"A15","v":"I"},{"$f":"IF(ISBLANK(B15),\" \",B15)","v":"Primary drying ramp "},{"$f":"M25","v":12.016666666666669},{"$f":"$C$30","v":40},{"$f":"IF(ISBLANK(E15),\" \",E15)","v":100},null,{"$f":"M26+(M27-M26)/2","v":12.850000000000001},{"$f":"$Q$8&\": \"&L26","v":"period label: Primary drying ramp "},null,null,{"$f":"Q26","v":12.850000000000001},{"$f":"$V$8&\": \"& O26","v":"time period label: 100"},null,null,null,{"$f":"A15","v":"I"},{"$f":"L26","v":"Primary drying ramp "},{"$f":"M26","v":12.016666666666669},{"$f":"F63","v":0},{"$f":"TEXT(E15,0)&\" min\"","v":"100 min"},null,{"$f":"$AF$8&\": \"&AA26","v":"period vertical line: Primary drying ramp "}]
[null,null,null,null,null,null,null,null,null,null,null,null,{"$f":"F15","v":13.683333333333335},{"$f":"$C$30","v":40},null,null,{"$f":"$C$29","v":45},null,null,null,{"$f":"$C$31","v":-55},null,null,null,null,null,null,{"$f":"M26","v":12.016666666666669},{"$f":"$F$30","v":4}]
[null,null,null,null,null,null,null,null,null,null,{"$f":"A16","v":"J"},{"$f":"IF(ISBLANK(B16),\" \",B16)","v":"Primary drying hold"},{"$f":"M27","v":13.683333333333335},{"$f":"$C$30","v":40},{"$f":"IF(ISBLANK(E16),\" \",E16)","v":720},null,{"$f":"M28+(M29-M28)/2","v":19.683333333333337},{"$f":"$Q$8&\": \"&L28","v":"period label: Primary drying hold"},null,null,{"$f":"Q28","v":19.683333333333337},{"$f":"$V$8&\": \"& O28","v":"time period label: 720"},null,null,null,{"$f":"A16","v":"J"},{"$f":"L28","v":"Primary drying hold"},{"$f":"M28","v":13.683333333333335},{"$f":"F65","v":0},{"$f":"TEXT(E16,0)&\" min\"","v":"720 min"},null,{"$f":"$AF$8&\": \"&AA28","v":"period vertical line: Primary drying hold"}]
[null,"Value for Y1",45,null,"Value for Y2 (min)",0,null,null,null,null,null,null,{"$f":"F16","v":25.683333333333337},{"$f":"$C$30","v":40},null,null,{"$f":"$C$29","v":45},null,null,null,{"$f":"$C$31","v":-55},null,null,null,null,null,null,{"$f":"M28","v":13.683333333333335},{"$f":"$F$30","v":4}]
[null,null,40,null,"Value for Y2 (max)",4,null,null,null,null,{"$f":"A17","v":"K"},{"$f":"IF(ISBLANK(B17),\" \",B17)","v":"secondary drying ramp"},{"$f":"M29","v":25.683333333333337},{"$f":"$C$30","v":40},{"$f":"IF(ISBLANK(E17),\" \",E17)","v":360},null,{"$f":"M30+(M31-M30)/2","v":28.683333333333337},{"$f":"$Q$8&\": \"&L30","v":"period label: secondary drying ramp"},null,null,{"$f":"Q30","v":28.683333333333337},{"$f":"$V$8&\": \"& O30","v":"time period label: 360"},null,null,null,{"$f":"A17","v":"K"},{"$f":"L30","v":"secondary drying ramp"},{"$f":"M30","v":25.683333333333337},{"$f":"F67","v":0},{"$f":"TEXT(E17,0)&\" min\"","v":"360 min"},null,{"$f":"$AF$8&\": \"&AA30","v":"period vertical line: secondary drying ramp"}]
[null,null,-55,null,null,null,null,null,null,null,null,null,{"$f":"F17","v":31.683333333333337},{"$f":"$C$30","v":40},null,null,{"$f":"$C$29","v":45},null,null,null,{"$f":"$C$31","v":-55},null,null,null,null,null,null,{"$f":"M30","v":25.683333333333337},{"$f":"$F$30","v":4}]
[null,null,null,null,null,null,null,null,null,null,{"$f":"A18","v":"L"},{"$f":"IF(ISBLANK(B18),\" \",B18)","v":" "},{"$f":"M31","v":31.683333333333337},{"$f":"$C$30","v":40},{"$f":"IF(ISBLANK(E18),\" \",E18)","v":" "},null,{"$f":"M32+(M33-M32)/2","v":31.683333333333337},{"$f":"$Q$8&\": \"&L32","v":"period label:  "},null,null,{"$f":"Q32","v":31.683333333333337},{"$f":"$V$8&\": \"& O32","v":"time period label:  "},null,null,null,{"$f":"A18","v":"L"},{"$f":"L32","v":" "},{"$f":"M32","v":31.683333333333337},{"$f":"F69","v":0},{"$f":"TEXT(E18,0)&\" min\"","v":"0 min"},null,{"$f":"$AF$8&\": \"&AA32","v":"period vertical line:  "}]
[null,null,null,null,null,null,null,null,null,null,null,null,{"$f":"F18","v":31.683333333333337},{"$f":"$C$30","v":40},null,null,{"$f":"$C$29","v":45},null,null,null,{"$f":"$C$31","v":-55},null,null,null,null,null,null,{"$f":"M32","v":31.683333333333337},{"$f":"$F$30","v":4}]
[null,null,null,null,null,null,null,null,null,null,{"$f":"A19","v":"M"},{"$f":"IF(ISBLANK(B19),\" \",B19)","v":" "},{"$f":"M33","v":31.683333333333337},{"$f":"$C$30","v":40},{"$f":"IF(ISBLANK(E19),\" \",E19)","v":" "},null,{"$f":"M34+(M35-M34)/2","v":31.683333333333337},{"$f":"$Q$8&\": \"&L34","v":"period label:  "},null,null,{"$f":"Q34","v":31.683333333333337},{"$f":"$V$8&\": \"& O34","v":"time period label:  "},null,null,null,{"$f":"A19","v":"M"},{"$f":"L34","v":" "},{"$f":"M34","v":31.683333333333337},{"$f":"F71","v":0},{"$f":"TEXT(E19,0)&\" min\"","v":"0 min"},null,{"$f":"$AF$8&\": \"&AA34","v":"period vertical line:  "}]
[null,null,null,null,null,null,null,null,null,null,null,null,{"$f":"F19","v":31.683333333333337},{"$f":"$C$30","v":40},null,null,{"$f":"$C$29","v":45},null,null,null,{"$f":"$C$31","v":-55},null,null,null,null,null,null,{"$f":"M34","v":31.683333333333337},{"$f":"$F$30","v":4}]
[null,null,null,null,null,null,null,null,null,null,{"$f":"A20","v":"N"},{"$f":"IF(ISBLANK(B20),\" \",B20)","v":" "},{"$f":"M35","v":31.683333333333337},{"$f":"$C$30","v":40},{"$f":"IF(ISBLANK(E20),\" \",E20)","v":" "},null,{"$f":"M36+(M37-M36)/2","v":31.683333333333337},{"$f":"$Q$8&\": \"&L36","v":"period label:  "},null,null,{"$f":"Q36","v":31.683333333333337},{"$f":"$V$8&\": \"& O36","v":"time period label:  "},null,null,null,{"$f":"A20","v":"N"},{"$f":"L36","v":" "},{"$f":"M36","v":31.683333333333337},{"$f":"F73","v":0},{"$f":"TEXT(E20,0)&\" min\"","v":"0 min"},null,{"$f":"$AF$8&\": \"&AA36","v":"period vertical line:  "}]
[null,null,null,null,null,null,null,null,null,null,null,null,{"$f":"F20","v":31.683333333333337},{"$f":"$C$30","v":40},null,null,{"$f":"$C$29","v":45},null,null,null,{"$f":"$C$31","v":-55},null,null,null,null,null,null,{"$f":"M36","v":31.683333333333337},{"$f":"$F$30","v":4}]
[null,null,null,null,null,null,null,null,null,null,{"$f":"A21","v":"O"},{"$f":"IF(ISBLANK(B21),\" \",B21)","v":" "},{"$f":"M37","v":31.683333333333337},{"$f":"$C$30","v":40},{"$f":"IF(ISBLANK(E21),\" \",E21)","v":" "},null,{"$f":"M38+(M39-M38)/2","v":31.683333333333337},{"$f":"$Q$8&\": \"&L38","v":"period label:  "},null,null,{"$f":"Q38","v":31.683333333333337},{"$f":"$V$8&\": \"& O38","v":"time period label:  "},null,null,null,{"$f":"A21","v":"O"},{"$f":"L38","v":" "},{"$f":"M38","v":31.683333333333337},{"$f":"F75","v":0},{"$f":"TEXT(E21,0)&\" min\"","v":"0 min"},null,{"$f":"$AF$8&\": \"&AA38","v":"period vertical line:  "}]
[null,null,null,null,null,null,null,null,null,null,null,null,{"$f":"F21","v":31.683333333333337},{"$f":"$C$30","v":40},null,null,{"$f":"$C$29","v":45},null,null,null,{"$f":"$C$31","v":-55},null,null,null,null,null,null,{"$f":"M38","v":31.683333333333337},{"$f":"$F$30","v":4}]
[null,null,null,null,null,null,null,null,null,null,{"$f":"A22","v":"P"},{"$f":"IF(ISBLANK(B22),\" \",B22)","v":" "},{"$f":"M39","v":31.683333333333337},{"$f":"$C$30","v":40},{"$f":"IF(ISBLANK(E22),\" \",E22)","v":" "},null,{"$f":"M40+(M41-M40)/2","v":31.683333333333337},{"$f":"$Q$8&\": \"&L40","v":"period label:  "},null,null,{"$f":"Q40","v":31.683333333333337},{"$f":"$V$8&\": \"& O40","v":"time period label:  "},null,null,null,{"$f":"A22","v":"P"},{"$f":"L40","v":" "},{"$f":"M40","v":31.683333333333337},{"$f":"F77","v":0},{"$f":"TEXT(E22,0)&\" min\"","v":"0 min"},null,{"$f":"$AF$8&\": \"&AA40","v":"period vertical line:  "}]
[null,null,null,null,null,null,null,null,null,null,null,null,{"$f":"F22","v":31.683333333333337},{"$f":"$C$30","v":40},null,null,{"$f":"$C$29","v":45},null,null,null,{"$f":"$C$31","v":-55},null,null,null,null,null,null,{"$f":"M40","v":31.683333333333337},{"$f":"$F$30","v":4}]
[null,null,null,null,null,null,null,null,null,null,{"$f":"A23","v":"Q"},{"$f":"IF(ISBLANK(B23),\" \",B23)","v":" "},{"$f":"M41","v":31.683333333333337},{"$f":"$C$30","v":40},{"$f":"IF(ISBLANK(E23),\" \",E23)","v":" "},null,{"$f":"M42+(M43-M42)/2","v":31.683333333333337},{"$f":"$Q$8&\": \"&L42","v":"period label:  "},null,null,{"$f":"Q42","v":31.683333333333337},{"$f":"$V$8&\": \"& O42","v":"time period label:  "},null,null,null,{"$f":"A23","v":"Q"},{"$f":"L42","v":" "},{"$f":"M42","v":31.683333333333337},{"$f":"F79","v":0},{"$f":"TEXT(E23,0)&\" min\"","v":"0 min"},null,{"$f":"$AF$8&\": \"&AA42","v":"period vertical line:  "}]
[null,null,null,null,null,null,null,null,null,null,null,null,{"$f":"F23","v":31.683333333333337},{"$f":"$C$30","v":40},null,null,{"$f":"$C$29","v":45},null,null,null,{"$f":"$C$31","v":-55},null,null,null,null,null,null,{"$f":"M42","v":31.683333333333337},{"$f":"$F$30","v":4}]
[null,null,null,null,null,null,null,null,null,null,{"$f":"A24","v":"R"},{"$f":"IF(ISBLANK(B24),\" \",B24)","v":" "},{"$f":"M43","v":31.683333333333337},{"$f":"$C$30","v":40},{"$f":"IF(ISBLANK(E24),\" \",E24)","v":" "},null,{"$f":"M44+(M45-M44)/2","v":31.683333333333337},{"$f":"$Q$8&\": \"&L44","v":"period label:  "},null,null,{"$f":"Q44","v":31.683333333333337},{"$f":"$V$8&\": \"& O44","v":"time period label:  "},null,null,null,{"$f":"A24","v":"R"},{"$f":"L44","v":" "},{"$f":"M44","v":31.683333333333337},{"$f":"F81","v":0},{"$f":"TEXT(E24,0)&\" min\"","v":"0 min"},null,{"$f":"$AF$8&\": \"&AA44","v":"period vertical line:  "}]
[null,null,null,null,null,null,null,null,null,null,null,null,{"$f":"F24","v":31.683333333333337},{"$f":"$C$30","v":40},null,null,{"$f":"$C$29","v":45},null,null,null,{"$f":"$C$31","v":-55},null,null,null,null,null,null,{"$f":"M44","v":31.683333333333337},{"$f":"$F$30","v":4}]
[null,null,null,null,null,null,null,null,null,null,{"$f":"A25","v":"S"},{"$f":"IF(ISBLANK(B25),\" \",B25)","v":" "},{"$f":"M45","v":31.683333333333337},{"$f":"$C$30","v":40},{"$f":"IF(ISBLANK(E25),\" \",E25)","v":" "},null,{"$f":"M46+(M47-M46)/2","v":31.683333333333337},{"$f":"$Q$8&\": \"&L46","v":"period label:  "},null,null,{"$f":"Q46","v":31.683333333333337},{"$f":"$V$8&\": \"& O46","v":"time period label:  "},null,null,null,{"$f":"A25","v":"S"},{"$f":"L46","v":" "},{"$f":"M46","v":31.683333333333337},{"$f":"F83","v":0},{"$f":"TEXT(E25,0)&\" min\"","v":"0 min"},null,{"$f":"$AF$8&\": \"&AA46","v":"period vertical line:  "}]
[null,null,null,null,null,null,null,null,null,null,null,null,{"$f":"F25","v":31.683333333333337},{"$f":"$C$30","v":40},null,null,{"$f":"$C$29","v":45},null,null,null,{"$f":"$C$31","v":-55},null,null,null,null,null,null,{"$f":"M46","v":31.683333333333337},{"$f":"$F$30","v":4}]
[null,null,null,null,null,null,null,null,null,null,{"$f":"A26","v":"T"},{"$f":"IF(ISBLANK(B26),\" \",B26)","v":" "},{"$f":"M47","v":31.683333333333337},{"$f":"$C$30","v":40},{"$f":"IF(ISBLANK(E26),\" \",E26)","v":" "},null,{"$f":"M48+(M49-M48)/2","v":31.683333333333337},{"$f":"$Q$8&\": \"&L48","v":"period label:  "},null,null,{"$f":"Q48","v":31.683333333333337},{"$f":"$V$8&\": \"& O48","v":"time period label:  "},null,null,null,{"$f":"A26","v":"T"},{"$f":"L48","v":" "},{"$f":"M48","v":31.683333333333337},{"$f":"F85","v":0},{"$f":"TEXT(E26,0)&\" min\"","v":"0 min"},null,{"$f":"$AF$8&\": \"&AA48","v":"period vertical line:  "}]
[null,null,null,null,null,null,null,null,null,null,null,null,{"$f":"F26","v":31.683333333333337},{"$f":"$C$30","v":40},null,null,{"$f":"$C$29","v":45},null,null,null,{"$f":"$C$31","v":-55},null,null,null,null,null,null,{"$f":"M48","v":31.683333333333337},{"$f":"$F$30","v":4}]
[]
[]
[]
[]
[]
[]
[]
[]
[]
[]
[]
[]
[null,"Drop down list options for cycle builder"]
[null,"Equilibrium phase "]
[null,"Freezing ramp"]
[null,"Freezing hold"]
[null,"Re-heating ramp "]
[null,"Annealing hold"]
[null,"Annealing hold 1"]
[null,"Annealing hold 2"]
[null,"Annealing hold 3"]
[null,"Re-cooling ramp "]
[null,"Re-cooling hold"]
[null,"Vacuum applied"]
[null,"Primary drying hold"]
[null,"Primary drying ramp "]
[null,"Primary drying hold"]
[null,"secondary drying ramp"]
[null,"secondary drying hold"]

{"sheet":"Phase diagram","index":1,"n_rows":41,"n_cols":24,"rows_kept":41,"cut":false,"hidden":false,"merged":[[25,18,25,21]]}
[null,null,null,null,null,null,null,null,null,null,null,null,null,"Ambient conditions"]
["Lyo cycle (live)",null,null,null,null,null,"Graph in the format suitable for book chapter or manuscript",null,null,null,null,null,null,"Room temperature",20," °C",null,null,null,null,null,{"$f":"N2&\" \"&TEXT(O2,\"0\")&\" \"&P2","v":"Room temperature 20  °C"}]
["t (start)",0,"min",null,null,null,null,null,null,null,null,null,null,"Formulation parameters"]
["dt",10,"min",null,null,null,null,null,null,null,null,null,null,"Glass transiton temperature",-34," °C",null,null,null,null,null,{"$f":"N4&\" \"&TEXT(O4,\"0\")&\" \"&P4","v":"Glass transiton temperature -34  °C"}]
["time (t- dt)",140,"min",null,null,null,null,null,null,null,null,null,null,"Eutectic temperature",-15," °C",null,null,null,null,null,{"$f":"N5&\" \"&TEXT(O5,\"0\")&\" \"&P5","v":"Eutectic temperature -15  °C"}]
["time (t)",140,"min",null,null,null,null,null,null,null,null,null,null,"Collapse temperature",-32," °C",null,null,null,null,null,{"$f":"N6&\" \"&TEXT(O6,\"0\")&\" \"&P6","v":"Collapse temperature -32  °C"}]
["Ts (0)",20," °C",null,null,null,null,null,null,null,null,null,null,"Process parameters"]
["rate",-0.5,null,null,null,null,null,null,null,null,null,null,null,"Nucleation temperature",-12," °C",null,null,null,"log chamber pressure",{"$f":"VLOOKUP(O8,'Data for phase diagram'!B7:J237,9,FALSE)","v":-2.6629003036383168},{"$f":"N8&\" \"&TEXT(O8,\"0\")&P8","v":"Nucleation temperature -12 °C"}]
["dT",{"$f":"B8*B4","v":-5}," °C"]
["Ts (t - dt)",-50," °C",null,null,null,null,null,null,null,null,null,null,null,"set temperature",null,"heating/cooling rate (°C min-1)","ramp/hold (min)","set pressure (chamber, µbar)","set pressure (chamber, bar)","log chamber pressure/bar"]
["Ts (t)",-50," °C",null,null,null,null,null,null,null,null,null,null,"Set parameters"]
["Pc (bar)",0,"bar",null,null,null,null,null,null,null,null,null,null,"Set point (Equilibration) Shelf temperature",{"$f":"'Lyo-cycle'!C6","v":20}," °C",null,null,null,1,{"$f":"LOG(T12)","v":0},{"$f":"\"Ts = \"&O12&P12","v":"Ts = 20 °C"},"Ts",{"$f":"TEXT(W12,0)","v":"Ts"}]
[null,null,null,null,null,null,null,null,null,null,null,null,null,"Set point (freezing) Shelf temperature",{"$f":"'Lyo-cycle'!C7","v":-50}," °C",0.5,{"$f":"(O13-O12)/Q13","v":-140},null,1,{"$f":"LOG(T13)","v":0},{"$f":"\"Ts = \"&O13&P13","v":"Ts = -50 °C"}]
[null,null,null,null,null,null,null,null,null,null,null,null,null,"Set point (primary drying) chamber vacuum",{"$f":"'Lyo-cycle'!C8","v":-50}," °C",0,null,{"$f":"'Lyo-cycle'!H13*1000","v":400},{"$f":"S14/1000000","v":4.0000000000000002E-4},{"$f":"LOG(T14)","v":-3.3979400086720375},"Ts = -50 °C"]
[null,null,null,null,null,null,null,null,null,null,null,null,null,"Set point (primary drying) shelf temperature",{"$f":"'Lyo-cycle'!C15","v":10}," °C",0.5,{"$f":"(O15-O14)/Q15","v":120},{"$f":"S14","v":400},{"$f":"S15/1000000","v":4.0000000000000002E-4},{"$f":"LOG(T15)","v":-3.3979400086720375},"Ts = 10 °C"]
[null,null,null,null,null,null,null,null,null,null,null,null,null,"Set point (secondary drying) shelf temperature",20," °C",0.5,{"$f":"(O16-O15)/Q16","v":20},null,null,null,"Ts = 20 °C"]
[]
[null,null,null,null,null,null,null,null,null,null,null,null,null,"Set point (primary drying) condensor temperature",-80," °C"]
[]
[null,null,null,null,null,null,null,null,null,null,null,null,null,"The ramp time is the time for the system to reach the set temperature"]
[null,null,null,null,null,null,null,null,null,null,null,null,null,"It is determined by the heating or cooling rate applied"]
[]
[null,null,null,null,null,null,"height of call out data labels = 0.75 cm",null,null,null,null,null,null,"Process parameters (resulting from the set parameters)"]
[null,null,null,null,null,null,null,"Enter lowest temperature on the x-axis",-120,null,null,null,null,null,"Tp",null,"Pi"]
[null,null,null,null,null,null,null,"Enter lowest log pressure on the y-axis",-7,null,null,null,null,"DT between Ti and Ts (Equilibration)",0,null,null,null,"Text for the call-outs on the data points on the graph"]
[null,null,null,null,null,null,null," dotted line - room temperature",{"$f":"O12","v":20},{"$f":"I25","v":-7},null,null,null,{"$f":"N12","v":"Set point (Equilibration) Shelf temperature"},{"$f":"O12+O25","v":20},null,{"$f":"VLOOKUP(O26,'Data for phase diagram'!B7:J237,9,FALSE)","v":-1.6309140791784922},null,{"$f":"\"Pi @ liquid interface \" & TEXT(10^Q26*10^6,\"0,000\")&\" \"& W26&\"bar\"","v":"Pi @ liquid interface 23,393 µbar"},null,null,null,"µ"]
[null,null,null,null,null,null,null,null,{"$f":"O12","v":20},{"$f":"U12","v":0},null,null,null,"DT between Ti and Ts (freezing)",0,null,null,null,null,null,null,null,"µ"]
[null,null,null,null,null,null,null," dotted line - room pressure",20,0,null,null,null,{"$f":"N13","v":"Set point (freezing) Shelf temperature"},{"$f":"O13+O27","v":-50},null,{"$f":"VLOOKUP(O28,'Data for phase diagram'!B7:J237,9,FALSE)","v":-4.4049449102406957},null,{"$f":"\"Pi @ ice interface \" & TEXT(10^Q28*10^6,0)&\" \"& W26&\"bar\"","v":"Pi @ ice interface 39 µbar"}]
[null,null,null,null,null,null,null,null,{"$f":"I24","v":-120},0,null,null,null,{"$f":"N18","v":"Set point (primary drying) condensor temperature"},{"$f":"O18","v":-80},null,{"$f":"VLOOKUP(O29,'Data for phase diagram'!B7:J237,9,FALSE)","v":-6.2596373105057559},null,{"$f":"N29&\" : Pi = \"&TEXT(10^Q29*10^6,\"0.00\")&\" \"& W27&\"bar\"","v":"Set point (primary drying) condensor temperature : Pi = 0.55 µbar"}]
[null,null,null,null,null,null,null," dotted line - primary drying shelf temperature & chamber pressure",{"$f":"O13","v":-50},{"$f":"I25","v":-7}]
[null,null,null,null,null,null,null,null,{"$f":"O13","v":-50},{"$f":"J27","v":0}]
[null,null,null,null,null,null,null," dotted line - condensor temperature & ice vapour pressure",{"$f":"I24","v":-120},{"$f":"Q29","v":-6.2596373105057559}]
[null,null,null,null,null,null,null,null,-80,{"$f":"Q29","v":-6.2596373105057559}]
[null,null,null,null,null,null,null,"dotted line - Pi at room temperature",{"$f":"I24","v":-120},{"$f":"Q26","v":-1.6309140791784922}]
[null,null,null,null,null,null,null,null,20,{"$f":"Q26","v":-1.6309140791784922}]
[null,null,null,null,null,null,null," dotted line - Pi at primary drying temperature",{"$f":"I24","v":-120},{"$f":"Q28","v":-4.4049449102406957}]
[null,null,null,null,null,null,null,null,-40,{"$f":"Q28","v":-4.4049449102406957}]
[null,null,null,null,null,null,null,"dotted line - primary drying temperature",{"$f":"O13","v":-50},{"$f":"U14","v":-3.3979400086720375}]
[null,null,null,null,null,null,null,null,{"$f":"O15","v":10},{"$f":"U15","v":-3.3979400086720375}]
[null,null,null,null,null,null,null,"solid line - collpase temperature",{"$f":"O6","v":-32},3]
[null,null,null,null,null,null,null,null,{"$f":"O6","v":-32},-7]

{"sheet":"Data for phase diagram","index":2,"n_rows":237,"n_cols":28,"rows_kept":237,"cut":false,"hidden":false,"merged":[[1,1,1,5],[0,1,0,10],[1,11,1,15],[1,17,1,21]]}
[null,"Vapour pressure of Liquid water and ice as a function of temp"]
[null,"Vapour Pressure of Liquid Water from 0°C to 373°C",null,null,null,null,null,null,null,null,null,"Melting Point Line 0°C to 40°C",null,null,null,null,null,"Temp/Pressure at 1 ATM"]
[null,"Temp C","Temp K",null,"Pressure HPa","Pressure Torr/mmHG","Ln Pressure Torr/mmHG","Pressure in BAR","LN Pressure in bar","Log Pressure in Bar",null,"Temp C","Temp K","Pressure by formula Torr","Ln Pressure by formula Torr","Log Pressure by formula Torr",null,"Temp C","Temp K","Pressure in PA","Pressure in Torr","Pressure in Ln Torr","Pressure in Bar","LN Pressure in Bar","Log Pressure in Bar"]
[]
[]
[]
[null,-80,{"$f":"B7+273.15","v":193.14999999999998},{"$f":"C7-273.2","v":-80.050000000000011},5.5E-2,{"$f":"E7*0.0075006168270417","v":4.1253392548729349E-4},{"$f":"LN(F7)","v":-7.7931921119657988},{"$f":"E7*0.00001","v":5.5000000000000003E-7},{"$f":"LN(H7)","v":-14.413347558719895},{"$f":"LOG(H7)","v":-6.2596373105057559},null,0,{"$f":"L7+273.15","v":273.14999999999998},{"$f":"EXP(20.386-(5132/M7))","v":4.942090375617866},{"$f":"LN(N7)","v":1.5977883946549483},{"$f":"LOG(N7)","v":0.69391068304769921},null,0,{"$f":"R7+273.15","v":273.14999999999998},101325,{"$f":"T7*0.0075006168270417","v":760.00000000000023},{"$f":"LN(U7)","v":6.633318433280377},{"$f":"T7*0.00001","v":1.01325},{"$f":"LN(W7)","v":1.3162986526280862E-2},{"$f":"LOG(W7)","v":5.7166124137306316E-3}]
[null,-75,198.14999999999998,-75.050000000000011,0.122,9.1507525289908731E-4,-6.9965042524650132,1.2200000000000002E-6,-13.61665969921911,-5.9136401693252516,null,-0.5,{"$f":"L8+273.15","v":272.64999999999998},{"$f":"EXP(20.386-(5132/M8))","v":4.7747116173997481},{"$f":"LN(N8)","v":1.5633335778470538},{"$f":"LOG(N8)","v":0.67894714623304331},null,0.01,{"$f":"R8+273.15","v":273.15999999999997},611.65700000000004,{"$f":"T8*0.0075006168270417","v":4.5878047865778449},{"$f":"LN(U8)","v":1.5234016496648333},{"$f":"T8*0.00001","v":6.1165700000000009E-3},{"$f":"LN(W8)","v":-5.0967537970892627},{"$f":"LOG(W8)","v":-2.2134920496953128}]
[null,-70,203.14999999999998,-70.050000000000011,0.26100000000000001,1.9576609918578835E-3,-6.2360048898755762,2.6100000000000004E-6,-12.856160336629673,-5.5833594926617192,null,-1,272.14999999999998,4.612417664700974,1.5287521587359905,0.66392862673672481]
[null,-65,208.14999999999998,-65.050000000000011,0.54,4.0503330866025183E-3,-5.5089561576399495,5.4000000000000008E-6,-12.129111604394046,-5.2676062401770318,null,-1.5,271.64999999999998,4.4550729615802007,1.4940434382477434,0.64885482095475677]
[null,-60,213.14999999999998,-60.050000000000011,1.08,8.1006661732050365E-3,-4.8158089770800041,1.0800000000000002E-5,-11.435964423834101,-4.9665762445130506,null,-2,271.14999999999998,4.3025450175011875,1.4592067121519428,0.63372542304377544,null,"Melting Curve using Simon-Glatzel equation 0°C to -80°C",null,null,null,null,"Melting curve from wiki plot"]
[null,-55,218.14999999999998,-55.050000000000011,2.093,1.5698791018998279E-2,-4.1541715747522696,2.0930000000000001E-5,-10.774327021506366,-4.6792307716613131,null,-2.5,270.64999999999998,4.1547043519656759,1.4242412710142212,0.61854012490035004,null,"Temp K","Pressure (Gpa)","Pressure bar","Log Pressure in bar",null,"Temp in Kelvin",null,"Pressure in MPA","Pressue in Bar","Log Pressure in Bar","LN Pressure in basr"]
[null,-50,223.14999999999998,-50.050000000000011,3.9359999999999999,2.9522427831236129E-2,-3.5226050390261254,3.9360000000000003E-5,-10.14276048578022,-4.4049449102406957,null,-3,270.14999999999998,4.0114244398428625,1.3891464001480642,0.60329861614007096,null,273.14999999999998,{"$f":"(2.17+1.253*(R13/354.8)^3-1)","v":1.7417469441256754},{"$f":"S13*10000","v":17417.469441256755},{"$f":"LOG(T13)","v":4.2409850572427654},null,273.14999999999998,{"$f":"W13-273.2","v":-5.0000000000011369E-2},{"$f":"101325*0.000001","v":0.101325},{"$f":"Y13*10","v":1.01325},{"$f":"LOG(Z13)","v":5.7166124137306316E-3},{"$f":"LN(Z13)","v":1.3162986526280862E-2}]
[null,-45,228.14999999999998,-45.050000000000011,7.202,5.4019442388354322E-2,-2.9184112529894488,7.2020000000000005E-5,-9.5385666997435443,-4.1425468829647336,null,-3.5,269.64999999999998,3.8725816573919905,1.3539213795661027,0.58800058407639655,null,272.64999999999998,{"$f":"(2.17+1.253*(R14/354.8)^3-1)","v":1.7386129463102895},{"$f":"S14*10000","v":17386.129463102894},{"$f":"LOG(T14)","v":4.240202909207361},null,273.16000000000003,{"$f":"W14-273.2","v":-3.999999999996362E-2},{"$f":"611.657*0.000001","v":6.1165700000000004E-4},{"$f":"Y14*10","v":6.11657E-3},-2.2134920496953128,-5.0967537970892627]
[null,-40,233.14999999999998,-40.050000000000011,12.84,9.6307920059215429E-2,-2.340204719954317,1.284E-4,-8.9603601667084138,-3.8914349762671656,null,-4,269.14999999999998,3.7380552289749245,1.3185654839308896,0.57264571369927619,null,272.14999999999998,1.7354904220233993,17354.904220233992,4.2394222211916057,null,272.89999999999998,-0.30000000000001137,5,{"$f":"Y15*10","v":50},1.6989700043360187,3.912023005428146]
[null,-39.5,233.64999999999998,-39.550000000000011,13.59,0.1019333826794967,-2.2834357900530797,1.359E-4,-8.9035912368071752,-3.8667805432675055,null,-4.5,268.64999999999998,3.6077271744551198,1.283077982505116,0.55723368765352899,null,271.64999999999998,1.7323793502242406,17323.793502242406,4.2386429983450862,null,272.44,-0.75999999999999091,10,100,2,4.6051701859880918]
[null,-39,234.14999999999998,-39.050000000000011,14.37,0.10778386380458922,-2.2276273181251987,1.437E-4,-8.8477827648792946,-3.8425432318657742,null,-5,268.14999999999998,3.4814822572794886,1.2474581391012478,0.54176418621697109,null,271.14999999999998,1.7292797098720505,17292.797098720504,4.2378652458066393,null,271.74,-1.4599999999999795,20,200,2.3010299956639813,5.2983173665480363]
[null,-38.5,234.64999999999998,-38.550000000000011,15.2,0.11400937577103383,-2.1714745903639017,1.5200000000000001E-4,-8.7916300371179972,-3.8181564120552274,null,-5.5,267.64999999999998,3.3592079332398175,1.2117052120306333,0.52623688727831386,null,270.64999999999998,1.7261914799260643,17261.914799260641,4.2370889687041471,null,269.18,-4.0199999999999818,50,500,2.6989700043360187,6.2146080984221914]
[null,-38,235.14999999999998,-38.050000000000011,16.07,0.12053491241056012,-2.1158158384667112,1.607E-4,-8.735971285220808,-3.7939841232366556,null,-6,267.14999999999998,3.2407942999099451,1.1758184540520276,0.51065146631480784,null,270.14999999999998,1.723114639345519,17231.14639345519,4.2363141721543265,null,264.52999999999997,-8.6700000000000159,100,1000,3,6.9077552789821368]
[null,-37.5,235.64999999999998,-37.550000000000011,16.989999999999998,0.12743547989143847,-2.0601450825322916,1.6990000000000001E-4,-8.680300529286388,-3.7698066211309542,null,-6.5,266.64999999999998,3.1261340467550087,1.139797112319517,0.4950075963696271,null,269.64999999999998,1.7200491670896501,17200.491670896499,4.2355408612625132,null,258.95,-14.25,150,1500,3.1760912590556813,7.3132203870903014]
[null,-37,236.14999999999998,-37.050000000000011,17.96,0.13471107821366893,-2.0046229553420787,1.7960000000000003E-4,-8.6247784020961742,-3.7456936676687143,null,-7,266.14999999999998,3.0151224059091821,1.1036404283298857,0.47930494802901069,null,269.14999999999998,1.716995042117694,17169.950421176942,4.2347690411224566,null,252.56,-20.639999999999986,200,2000,3.3010299956639813,7.6009024595420822]
[null,-36.5,236.64999999999998,-36.550000000000011,18.97,0.14228670120898104,-1.9499112342692093,1.897E-4,-8.5700666810233059,-3.7219326691113372,null,-7.5,265.64999999999998,2.9076571036179577,1.0673476378693749,0.46354318939913985,null,268.64999999999998,1.7139522433888872,17139.522433888873,4.2339987168161013]
[null,-36,237.14999999999998,-36.050000000000011,20.04,0.15031236121391567,-1.8950397419994682,2.0040000000000002E-4,-8.5151951887535642,-3.698102282804792,null,-8,265.14999999999998,2.8036383123411452,1.0309179709598304,0.44772198608275116,null,268.14999999999998,1.7109207498624661,17109.207498624663,4.2332298934133794]
[null,-35.5,237.64999999999998,-35.550000000000011,21.16,0.15871305206020236,-1.8406574112260337,2.1160000000000002E-4,-8.4608128579801303,-3.6744843366368518,null,-8.5,264.64999999999998,2.7029686035127587,0.99435065180426818,0.4318410011554954,null,267.64999999999998,1.7079005404976657,17079.005404976659,4.2324625759719954]
[null,-35,238.14999999999998,-35.050000000000011,22.35,0.16763878608438201,-1.7859436971565543,2.2350000000000004E-4,-8.4060991439106498,-3.6507224725320446,null,-9,264.14999999999998,2.6055529009536187,0.95764489873177894,0.41589989514200998,null,267.14999999999998,1.7048915942537239,17048.915942537238,4.2316967695372103,"0 °C and 1 bar",1,{"$f":"LOG(W25)","v":0},20]
[null,-34.5,238.64999999999998,-34.550000000000011,23.59,0.1769395509499137,-1.7319471247965486,2.3590000000000001E-4,-8.3521025715506454,-3.6272720591144045,null,-9.5,263.64999999999998,2.5112984349328884,0.92079992414185341,0.3998983259917398,null,266.64999999999998,1.7018938900898757,17018.938900898756,4.2309324791416332,"−40 °C and 1 bar",1,{"$f":"LOG(W26)","v":0},-40]
[null,-34,239.14999999999998,-34.050000000000011,24.9,0.18676535899333832,-1.6779022147454703,2.4899999999999998E-4,-8.2980576614995663,-3.6038006529042637,null,-10,263.14999999999998,2.4201146968741973,0.88381493444802928,0.38383594905446339,null,266.14999999999998,1.6989074069653576,16989.074069653576,4.2301697098050006,"−40 °C and 300 µbar",2.9999999999999997E-4,{"$f":"LOG(W27)","v":-3.5228787452803374},-40]
[null,-33.5,239.64999999999998,-33.550000000000011,26.27,0.19704120404638545,-1.6243424145186838,2.6270000000000004E-4,-8.2444978612727802,-3.5805399272139296,null,-10.5,262.64999999999998,2.3319133947024411,0.84668913002093771,0.36771241705555813,null,265.64999999999998,1.6959321238394063,16959.321238394063,4.2294084665339655,"−10 °C and 300 µbar",2.9999999999999997E-4,{"$f":"LOG(W28)","v":-3.5228787452803374},-10]
[null,-33,240.14999999999998,-33.050000000000011,27.71,0.2078420922773255,-1.5709766593412451,2.7710000000000001E-4,-8.1911321060953419,-3.5573634742177682,null,-11,262.14999999999998,2.2466084088268232,0.80942170513064937,0.35152738007096207,null,265.14999999999998,1.6929680196712571,16929.680196712572,4.2286487543218811,"−40 °C and 300 µbar",2.9999999999999997E-4,{"$f":"LOG(W29)","v":-3.5228787452803374},-40]
[null,-32.5,240.64999999999998,-32.550000000000011,29.23,0.21924302985442889,-1.5175744390929775,2.923E-4,-8.1377298858470741,-3.5341711846425636,null,-11.5,261.64999999999998,2.1641157487560996,0.77201184788839672,0.33528048550186335,null,264.64999999999998,1.6900150734201467,16900.150734201467,4.2278905781485845,null,5.0000000000000002E-5,-4.3010299956639813,-40]
[null,-32,241.14999999999998,-32.050000000000011,30.82,0.23116901060942519,-1.4646061883241626,3.0820000000000001E-4,-8.0847616350782587,-3.5111673656175997,null,-12,261.14999999999998,2.0843535103416366,0.73445874018763047,0.31897137804910197,null,264.14999999999998,1.6870732640453117,16870.732640453116,4.2271339429801813]
[null,-31.5,241.64999999999998,-31.550000000000011,32.49,0.24369504071058484,-1.4118376685351233,3.2490000000000004E-4,-8.0319931152892199,-3.4882502886550171,null,-12.5,260.64999999999998,2.0072418336438158,0.696761557644347,0.30259969968725442,null,263.64999999999998,1.6841425705059878,16841.425705059879,4.2263788537688285]
[null,-31,242.14999999999998,-31.050000000000011,34.24,0.25682112015790781,-1.3593754669425908,3.4240000000000003E-4,-7.9795309136966868,-3.4654662439948845,null,-13,260.14999999999998,1.9327028614176494,0.65891946953680147,0.28616508963845072,null,263.14999999999998,1.6812229717614109,16812.229717614107,4.2256253154525174,null,1.0000000000000001E-5,{"$f":"LOG(W33)","v":-5},-40]
[null,-30.5,242.64999999999998,-30.550000000000011,36.08,0.27062225511966453,-1.3070313230217092,3.6079999999999999E-4,-7.9271867697758056,-3.4427334711300959,null,-13.5,259.64999999999998,1.8606606982128728,0.62093163874446233,0.2696671843458634,null,262.64999999999998,1.678314446770818,16783.144467708178,4.2248733329548598]
[null,-30,243.14999999999998,-30.050000000000011,38.01,0.28509844559585501,-1.2549207352149749,3.8010000000000002E-4,-7.8750761819690709,-3.4201021303968964,null,-14,259.14999999999998,1.7910413700841961,0.58279722168628112,0.25310561744689808,null,262.14999999999998,1.6754169744934444,16754.169744934443,4.2241229111848639]
[null,-29.5,243.64999999999998,-29.550000000000011,40.04,0.30032469775474963,-1.2028910637691126,4.0040000000000003E-4,-7.8230465105232083,-3.3975059311927192,null,-14.5,258.64999999999998,1.723772784907148,0.54451536825825997,0.23648001974607941,null,261.64999999999998,1.6725305338885272,16725.305338885271,4.2233740550367234]
[null,-29,244.14999999999998,-29.050000000000011,42.16,0.31622600542807805,-1.1512981139830254,4.216E-4,-7.7714535607371218,-3.3750993977955099,null,-15,258.14999999999998,1.6587846932948902,0.50608522177028448,0.21979001918761798,null,261.14999999999998,1.6696551039153027,16696.551039153026,4.2226267693895956]
[null,-28.5,244.64999999999998,-28.550000000000011,44.39,0.33295238095238106,-1.0997557993701883,4.4390000000000006E-4,-7.7199112461242843,-3.3527148549746335,null,-15.5,257.64999999999998,1.5960086501113608,0.46750591888220328,0.20303524082765015,null,260.64999999999998,1.6667906635330061,16667.906635330062,4.2218810591073836]
[null,-28,{"$f":"B39+273.15","v":245.14999999999998},{"$f":"C39-273.2","v":-28.050000000000011},46.73,{"$f":"E39*0.0075006168270417","v":0.35050382432765859},{"$f":"LN(F39)","v":-1.0483836615037976},{"$f":"E39*0.00001","v":4.6730000000000003E-4},{"$f":"LN(H39)","v":-7.6685391082578933},{"$f":"LOG(H39)","v":-3.3304042189756866},null,-16,257.14999999999998,1.5353779765761371,0.4287765895391758,0.18621530680615961,null,260.14999999999998,1.6639371917008745,16639.371917008746,4.2211369290385168]
[null,-27.5,245.64999999999998,-27.550000000000011,49.18,0.36888033555391081,-0.99728298142808569,4.9180000000000003E-4,-7.6174384281821821,-3.3082114755973016,null,-16.5,256.64999999999998,1.4768277229563256,0.38989635690629137,0.16932983631858317,null,259.64999999999998,1.6610946673781433,16610.946673781433,4.2203943840157363]
[null,-27,246.14999999999998,-27.050000000000011,51.74,0.38808191463113756,-0.94653884145824918,5.1740000000000011E-4,-7.5666942882123456,-3.2861735756194754,null,-17,256.14999999999998,1.4202946318405902,0.35086433730235816,0.15237844558705543,null,259.14999999999998,1.6582630695240494,16582.630695240496,4.21965342885587]
[null,-26.5,246.64999999999998,-26.550000000000011,54.43,0.40825857389587972,-0.89585454577002355,5.4430000000000006E-4,-7.5160099925241193,-3.2641616656829262,null,-17.5,255.64999999999998,1.3657171019907568,0.3116796401329936,0.13536074783135044,null,258.64999999999998,1.6554423770978293,16554.423770978294,4.2189140683596174]
[null,-26,247.14999999999998,-26.050000000000011,57.25,0.42941031334813728,-0.84534237578178328,5.7250000000000009E-4,-7.4654978225358795,-3.2422245089880741,null,-18,255.14999999999998,1.3130351527659341,0.27234136782284679,0.1182763532394462,null,258.14999999999998,1.652632569058718,16526.325690587179,4.2181763073113272]
[null,-25.5,247.64999999999998,-25.550000000000011,60.2,0.45153713298791037,-0.79509766590135678,6.020000000000001E-4,-7.4152531126554528,-3.2204035087421752,null,-18.5,254.64999999999998,1.2621903891145305,0.23284861574710194,0.101124868937777,null,257.64999999999998,1.6498336243659528,16498.336243659527,4.2174401504787813]
[null,-25,248.14999999999998,-25.050000000000011,63.29,0.47471403898346914,-0.74504267942891833,6.3290000000000004E-4,-7.3651981261830146,-3.1986649043254536,null,-19,254.14999999999998,1.2131259671290748,0.19320047216210773,8.3905898961106201E-2,null,257.14999999999998,1.6470455219787694,16470.455219787695,4.2167056026129695]
[null,-24.5,248.64999999999998,-24.550000000000011,66.52,0.49894103133481382,-0.69526736389140542,6.6520000000000001E-4,-7.3154228106455017,-3.1770477594525182,null,-19.5,253.64999999999998,1.1657865601590602,0.15339601813522205,6.6619044222058083E-2,null,256.64999999999998,1.644268240856404,16442.68240856404,4.2159726684478755]
[null,-24,249.14999999999998,-24.050000000000011,69.91,0.52436812237848518,-0.64556131769223857,6.9910000000000003E-4,-7.265716764446335,-3.1554606978709923,null,-20,253.14999999999998,1.120118325476811,0.11343432747382565,4.9263902480288918E-2,null,256.14999999999998,1.6415017599580932,16415.017599580933,4.2152413527002528]
[null,-23.5,249.64999999999998,-23.550000000000011,73.45,0.55092030594621288,-0.59616511559624585,7.3450000000000013E-4,-7.2163205623503419,-3.1340081998737248,null,-20.5,252.64999999999998,1.0760688714913669,7.3314466653471341E-2,3.1840068311282568E-2,null,255.64999999999998,1.6387460582430728,16387.460582430729,4.2145116600694044]
[null,-23,250.14999999999998,-23.050000000000011,77.16,0.57874759437453749,-0.54688883017860401,7.716E-4,-7.1670442769327005,-3.1126077810281529,null,-21,252.14999999999998,1.0335872255054164,3.3035494745188645E-2,1.4347133074779301E-2,null,255.14999999999998,1.6360011146705791,16360.01114670579,4.2137835952369649]
[null,-22.5,250.64999999999998,-22.550000000000011,81.040000000000006,0.60784998766345943,-0.49782715827570417,8.1040000000000018E-4,-7.1179826050298001,-3.0913005676477758,null,-21.5,251.64999999999998,0.99262380201024802,-7.4035366580602422E-3,-3.2153151171640053E-3,null,254.64999999999998,1.6332669081998485,16332.669081998485,4.2130571628666766]
[null,-22,251.14999999999998,-22.050000000000011,85.1,0.63830249198124855,-0.44894298263680393,8.5099999999999998E-4,-7.0690984293909001,-3.070070439915412,null,-22,251.14999999999998,0.95313037151361146,-4.8003583515829E-2,-2.0847691432506435E-2,null,254.14999999999998,1.630543417790117,16305.43417790117,4.2123323676041737]
[null,-21.5,251.64999999999998,-21.550000000000011,89.34,0.67010510732790551,-0.40032070229215955,8.9340000000000014E-4,-7.0204761490462557,-3.0489540518641802,null,-22.5,250.64999999999998,0.91506002989543944,-8.8765609415521085E-2,-3.8550414351940142E-2,null,253.64999999999998,1.6278306224006207,16278.306224006206,4.2116092140767556]
[null,-21,252.14999999999998,-21.050000000000011,93.77,0.70333283987170014,-0.35192504278459852,9.3770000000000008E-4,-6.972080489538695,-3.0279360839919778,null,-23,250.14999999999998,0.87836716828632699,-0.12969058564861408,-5.6323905701994158E-2,null,253.14999999999998,1.6251285009905962,16251.285009905963,4.2108877068931703]
[null,-20.5,252.64999999999998,-20.550000000000011,98.41,0.73813570194917366,-0.30362759330523809,9.8410000000000012E-4,-6.9237830400593339,-3.0069607681930903,null,-23.5,249.64999999999998,0.84300744346361822,-0.17077949128780648,-7.416859068853883E-2,null,252.64999999999998,1.6224370325192794,16224.370325192795,4.2101678506433942]
[null,-20,253.14999999999998,-20.050000000000011,103.26,0.77451369356032596,-0.25551993876462914,1.0326000000000001E-3,-6.8756753855187256,-2.9860678792887962,null,-24,249.14999999999998,0.80893774875994995,-0.21203331326510269,-9.2084897930697671E-2,null,252.14999999999998,1.6197561959459064,16197.561959459064,4.2094496498984082]
[null,-19.5,253.64999999999998,-19.550000000000011,108.33,0.8125418208734273,-0.2075878942586562,1.0833000000000001E-3,-6.8277433410127522,-2.9652512568535108,null,-24.5,248.64999999999998,0.776116185479095,-0.25345304645083638,-0.1100732594951668,null,251.64999999999998,1.6170859702297138,16170.859702297137,4.2087331092099785]
[null,-19,254.14999999999998,-19.050000000000011,113.62,0.85222008388847792,-0.15991047108715142,1.1362000000000002E-3,-6.780065917841247,-2.9445452150587603,null,-25,248.14999999999998,0.74450203481392774,-0.29503969373363143,-0.12813411093094154,null,251.14999999999998,1.6144263343299374,16144.263343299373,4.2080182331104377]
[null,-18.5,254.64999999999998,-18.550000000000011,119.15,0.89369849494201858,-0.11238681467138104,1.1915000000000001E-3,-6.7325422614254773,-2.9239059533175249,null,-25.5,247.64999999999998,0.71405573026127633,-0.33679426610135366,-0.14626789130447332,null,250.64999999999998,1.6117772672058139,16117.77267205814,4.2073050261124614]
[null,-18,255.14999999999998,-18.050000000000011,124.92,0.93697705403404918,-6.509648580125435E-2,1.2492000000000002E-3,-6.6852519325553503,-2.9033680244418387,null,-26,247.14999999999998,0.68473883052846429,-0.37871778272304374,-0.16447504323525258,null,250.14999999999998,1.6091387478165795,16091.387478165794,4.2065934927088477]
[null,-17.5,255.64999999999998,-17.550000000000011,130.94999999999999,0.98220577350111049,-1.7954447262411428E-2,1.3094999999999999E-3,-6.638109894016508,-2.8828944972387491,null,-26.5,246.64999999999998,0.65651399292631829,-0.42081127103183036,-0.18275601293181765,null,249.64999999999998,1.6065107551214695,16065.107551214694,4.2058836373722999]
[null,-17,256.14999999999998,-17.050000000000011,137.25,1.0294596595114733,2.9034062173507819E-2,1.3725E-3,-6.591121384580588,-2.8624876468778706,null,-27,246.14999999999998,0.62934494724338075,-0.46307576680885998,-0.20111125022820489,null,249.14999999999998,1.6038932680797213,16038.932680797214,4.2051754645552011]
[null,-16.5,256.64999999999998,-16.550000000000011,143.82,1.0787387120651373,7.579249945821577E-2,1.4382000000000002E-3,-6.5443629472958804,-2.8421807155827024,null,-27.5,245.64999999999998,0.60319647009606558,-0.50551231426826948,-0.21954120862085194,null,248.64999999999998,1.6012862656505704,16012.862656505704,4.2044689786894001]
[null,-16,257.14999999999998,-16.050000000000011,150.68,1.1301929434986433,0.12238836460770806,1.5068000000000002E-3,-6.497767082146388,-2.8219443884687698,null,-28,245.14999999999998,0.57803435974951534,-0.54812196614318154,-0.23804634530594476,null,248.14999999999998,1.5986897267932529,15986.897267932529,4.2037641841859843]
[null,-15.5,257.64999999999998,-15.550000000000011,157.83000000000001,1.1838223538119916,0.16874848619469346,1.5783000000000004E-3,-6.4514069605594022,-2.8018104434831783,null,-28.5,244.64999999999998,0.55382541140387997,-0.59090578377274039,-0.2566271212172172,null,247.64999999999998,1.5961036304670055,15961.036304670055,4.2030610854350652]
[null,-15,258.14999999999998,-15.050000000000011,165.3,1.239851961509993,0.21499198661084629,1.6530000000000002E-3,-6.4051634601432497,-2.7817271464285525,null,-29,244.14999999999998,0.53053739294070756,-0.63386483719025577,-0.27528400106423123,null,247.14999999999998,1.593527955631064,15935.279556310639,4.2023596868055551]
[null,-14.5,258.64999999999998,-14.550000000000011,173.09,1.2982817665926478,0.26104167222217517,1.7309000000000003E-3,-6.3591137745319211,-2.7617280220741729,null,-29.5,243.64999999999998,0.50813902112420173,-0.67700020521239779,-0.29401745337111346,null,246.64999999999998,1.5909626812446649,15909.62681244665,4.2016599926449487]
[null,-14,259.14999999999998,-14.050000000000011,181.22,1.3592617813964969,0.30694174457778239,1.8122000000000001E-3,-6.3132137021763137,-2.7417938739311727,null,-30,243.14999999999998,0.48659993825202191,-0.72031297552951301,-0.31282795051577955,null,246.14999999999998,1.5884077862670445,15884.077862670445,4.2009620072791058]
[null,-13.5,259.64999999999998,-13.550000000000011,189.69,1.42279200592154,0.35262114252249926,1.8969000000000002E-3,-6.2675343042315967,-2.7219555634671191,null,-30.5,242.64999999999998,0.46589068925035498,-0.76380424479703635,-0.33171596876963344,null,245.64999999999998,1.5858632496574385,15858.632496574386,4.2002657350120254]
[null,-13,260.14999999999998,-13.050000000000011,198.52,1.4890224525043183,0.39811983250310784,1.9852000000000003E-3,-6.2220356142509878,-2.702195733474714,null,-31,242.14999999999998,0.44598269920793432,-0.80747511872806399,-0.35068198833777131,null,245.14999999999998,1.5833290503750836,15833.290503750837,4.1995711801256359]
[null,-12.5,260.64999999999998,-12.550000000000011,207.73,1.5581031334813722,0.44346914133046095,2.0773000000000002E-3,-6.1766863054236349,-2.6825007788928681,null,-31.5,241.64999999999998,0.42684825134373688,-0.85132671218704914,-0.36972649339967328,null,244.64999999999998,1.5808051673792156,15808.051673792155,4.1988783468795674]
[null,-12,{"$f":"B71+273.15","v":261.14999999999998},{"$f":"C71-273.2","v":-12.050000000000011},217.32,{"$f":"E71*0.0075006168270417","v":1.6300340488527021},{"$f":"LN(F71)","v":0.48860090346719004},{"$f":"E71*0.00001","v":2.1732000000000001E-3},{"$f":"LN(H71)","v":-6.1315545432869056},{"$f":"LOG(H71)","v":-2.6629003036383168},null,-32,241.14999999999998,0.40846046540303838,-0.89536014928468077,-0.38884997215040862,null,244.14999999999998,1.5782915796290711,15782.91579629071,4.198187239510939]
[null,-11.5,261.64999999999998,-11.550000000000011,227.32,1.7050402171231192,0.53358869821278854,2.2732E-3,-6.0865667485413075,-2.6433623526273071,null,-32.5,{"$f":"L72+273.15","v":240.64999999999998},{"$f":"EXP(20.386-(5132/M72))","v":0.39079327647654666},{"$f":"LN(N72)","v":-0.93957656347392771},{"$f":"LOG(N72)","v":-0.40805291684234724},null,243.64999999999998,1.5757882660838858,15757.882660838857,4.1974978622341377]
[null,-11,262.14999999999998,-11.050000000000011,237.74,1.7831966444608938,0.57840762133634605,2.3774000000000004E-3,-6.0417478254177501,-2.6238977416299001,null,-33,240.14999999999998,0.37382141423730314,-0.98397709764730479,-0.42733582382740165,null,243.14999999999998,1.5732952057028968,15732.952057028968,4.1968102192406027]
[null,-10.5,262.64999999999998,-10.550000000000011,248.59,1.8645783370342961,0.62303493478995675,2.4859000000000001E-3,-5.9971205119641393,-2.6045163456548304,null,-33.5,239.64999999999998,0.35752038259007696,-1.028562904235347,-0.4466991935997941,null,242.64999999999998,1.5708123774453395,15708.123774453396,4.1961243146986051]
[null,-10,263.14999999999998,-10.050000000000011,259.89999999999998,1.9494103133481375,0.66752692343131226,2.5990000000000002E-3,-5.952628523322784,-2.5851937204989874,null,-34,239.14999999999998,0.34186643972797237,-1.0733351453062951,-0.46614353083934901,null,242.14999999999998,1.5683397602704501,15683.397602704501,4.1954401527530329]
[null,-9.5,263.64999999999998,-9.5500000000000114,271.68,2.0377675795706889,0.71185488490685023,2.7168000000000001E-3,-5.9083005618472457,-2.5659423314361414,null,-34.5,238.64999999999998,0.32683657859094339,-1.1182949926670886,-0.48566934445535409,null,241.64999999999998,1.5658773331374656,15658.773331374656,4.1947577375251726]
[null,-9,264.14999999999998,-9.0500000000000114,283.94,2.1297251418702201,0.75599293001929557,2.8394000000000002E-3,-5.8641625167348002,-2.5467734220018095,null,-35,238.14999999999998,0.31240850772098872,-1.1634436279655702,-0.505277147630947,null,241.14999999999998,1.5634250750056213,15634.250750056213,4.194077073112493]
[null,-8.5,264.64999999999998,-8.5500000000000114,296.7,2.2254330125832724,0.79995150908064394,2.967E-3,-5.820203937673452,-2.5276824536831581,null,-35.5,237.64999999999998,0.29856063250872766,-1.208782242794026,-0.5249674578680823,null,240.64999999999998,{"$f":"(2.17+1.253*(R78/354.8)^3-1)","v":1.560982964834154},{"$f":"S78*10000","v":15609.82964834154},{"$f":"LOG(T78)","v":4.1933981635884301}]
[null,-8,265.14999999999998,-8.0500000000000114,309.98,2.3250412040463861,0.84373776105277254,3.0998000000000006E-3,-5.7764176857013236,-2.5086663260684374,null,-36,237.14999999999998,0.28527203682613073,-1.2543120387940156,-0.54474079703305855,null,240.14999999999998,1.5585509815822993,15585.509815822994,4.1927210130021697]
[null,-7.5,265.64999999999998,-7.5500000000000114,323.8,2.4286997285961025,0.88735602302740257,3.2380000000000004E-3,-5.7327994237266937,-2.4897231555826451,null,-36.5,236.64999999999998,0.27252246504016053,-1.3000342277625201,-0.56459769140261773,null,239.64999999999998,1.5561291042092944,15561.291042092944,4.1920456253784328]
[null,-7,266.14999999999998,-7.0500000000000114,338.19,2.5366336047372324,0.93083784950841741,3.3819000000000002E-3,-5.6893175972456786,-2.4708392382788658,null,-37,236.14999999999998,0.26029230440208256,-1.3459500317594788,-0.58453867171064822,null,239.14999999999998,1.5537173116743745,15537.173116743745,4.1913720047172616]
[null,-6.5,266.64999999999998,-6.5500000000000114,353.16,2.648917838638047,0.97415119381724957,3.5316000000000006E-3,-5.6460042529368462,-2.4520284918527642,null,-37.5,235.64999999999998,0.24856256780726019,-1.3920606832166378,-0.60456427319545647,null,238.64999999999998,1.5513155829367764,15513.155829367764,4.1907001549938041]
[null,-6,267.14999999999998,-6.0500000000000114,368.73,2.765702442635086,1.0172946506788669,3.6873000000000006E-3,-5.6028607960752295,-2.4332915266075328,null,-38,235.14999999999998,0.23731487692020406,-1.4383674250478435,-0.62467503564766758,null,238.14999999999998,1.5489238969557362,15489.238969557362,4.190030080158099]
[null,-5.5,267.64999999999998,-5.5500000000000114,384.92,2.8871374290648912,1.060265502272068,3.8492000000000005E-3,-5.5598899444820278,-2.414629522877922,null,-38.5,234.64999999999998,0.22653144565971778,-1.484871510760712,-0.64487150345872224,null,237.64999999999998,1.5465422326904896,15465.422326904896,4.1893617841348663]
[null,-5,268.14999999999998,-5.0500000000000114,401.76,3.0134478164322731,1.1030848771931425,4.0176000000000005E-3,-5.5170705695609534,-2.3960333046311528,null,-39,234.14999999999998,0.21619506403896596,-1.531574204569722,-0.66515422566999249,null,237.14999999999998,1.5441705691002738,15441.705691002739,4.1886952708232901]
[null,-4.5,268.64999999999998,-4.5500000000000114,419.27,3.1447836170737733,1.1457450855831259,4.1927000000000006E-3,-5.4744103611709702,-2.3775062115305401,null,-39.5,233.64999999999998,0.20628908235530516,-1.5784767815108083,-0.68552375602254889,null,236.64999999999998,1.5418088851443241,15418.088851443241,4.1880305440968089]
[null,-4,269.14999999999998,-4.0500000000000114,437.47,3.2812948433259326,1.1882381138018376,4.3747000000000005E-3,-5.4319173329522581,-2.3590517238557944,null,-40,233.14999999999998,0.19679739572477353,-1.6255805275573678,-0.70598065300754187,null,236.14999999999998,1.5394571597818771,15394.571597818771,4.1873676078029023]
[null,-3.5,269.64999999999998,-3.5500000000000114,456.39,3.4232065136935614,1.2305776889270148,4.5639000000000001E-3,-5.3895777578270812,-2.3406638800128019,null,null,null,null,null,null,null,235.64999999999998,1.5371153719721686,15371.153719721686,4.1867064657628807]
[null,-3,270.14999999999998,-3.0500000000000114,476.06,3.5707436466814717,1.2727738784917693,4.7606000000000002E-3,-5.3473815682623274,-2.3223383077274855,null,null,null,null,null,null,null,235.14999999999998,1.5347835006744357,15347.835006744357,4.1860471217716766]
[null,-2.5,270.64999999999998,-2.5500000000000114,496.49,3.7239812484579335,1.3147933240793543,4.9649000000000004E-3,-5.3053621226747421,-2.3040894943761634,null,null,null,null,null,null,null,234.64999999999998,1.5324615248479141,15324.61524847914,4.1853895795976301]
[null,-2,271.14999999999998,-2.0500000000000114,517.72,3.8832193436960289,1.3566645373581052,5.1772000000000007E-3,-5.2634909093959905,-2.2859050574986077,null,null,null,null,null,null,null,234.14999999999998,1.5301494234518396,15301.494234518395,4.1847338429822827]
[null,-1.5,271.64999999999998,-1.5500000000000114,539.77,4.0486079447322982,1.3983731046840504,5.3977000000000001E-3,-5.2217823420700462,-2.2677912568608596,null,null,null,null,null,null,null,233.64999999999998,1.5278471754454492,15278.471754454493,4.1840799156401696]
[null,-1,272.14999999999998,-1.0500000000000114,562.66999999999996,4.2203720700715532,1.4399232924247287,5.6267000000000001E-3,-5.1802321543293672,-2.2497462396030388,null,null,null,null,null,null,null,233.14999999999998,1.5255547597879784,15255.547597879784,4.1834278012586088]
[null,-0.5,272.64999999999998,-0.55000000000001137,586.45000000000005,4.3987367382186049,1.4813173947513818,5.8645000000000008E-3,-5.1388380520027139,-2.2317690093792346,null,null,null,null,null,null,null,228.14999999999998,1.5031667534358331,15031.66753435833,4.1770071616114715]
[null,0,273.14999999999998,-5.0000000000011369E-2,6.1115000000000004,{"$f":"E95*0.75006168270417","v":4.5840019738465347},1.5225724100071396,{"$f":"E95*0.001","v":6.1115000000000006E-3},-5.0975830367469568,-2.2138521839028247,null,null,null,null,null,null,null,223.14999999999998,1.4817388371355071,14817.388371355071,4.1707716641116885]
[null,0.01,{"$f":"B96+273.15","v":273.15999999999997},{"$f":"C96-273.2","v":-4.0000000000020464E-2},6.1165700000000003,{"$f":"E96*0.75006168270417","v":4.5878047865778449},{"$f":"LN(F96)","v":1.5234016496648333},{"$f":"E96*0.001","v":6.11657E-3},{"$f":"LN(H96)","v":-5.0967537970892627},{"$f":"LOG(H96)","v":-2.2134920496953128},null,null,null,null,null,null,null,218.14999999999998,1.4612499701232098,14612.499701232098,4.1647245152902901]
[null,1,274.14999999999998,0.94999999999998863,6.5709,4.9285803108808306,1.5950509771880816,6.5709000000000002E-3,-5.0251044695660143,-2.1823751421198874,null,null,null,null,null,null,null,213.14999999999998,1.4416791116351479,14416.79111635148,4.1588686060461262]
[null,2,275.14999999999998,1.9499999999999886,7.0598999999999998,5.2953604737231696,1.666831054870846,7.0599E-3,-4.9533243918832497,-2.1512014504716759,null,null,null,null,null,null,null,208.14999999999998,1.4230052209075312,14230.052209075313,4.1532064934835615]
[null,3,276.14999999999998,2.9499999999999886,7.5808,5.6860676042437719,1.7380189027542885,7.5808000000000004E-3,-4.8821365439998079,-2.1202849609573291,null,null,null,null,null,null,null,203.14999999999998,1.4052072571765666,14052.072571765666,4.1477403840345897]
[null,4,277.14999999999998,3.9499999999999886,8.1355000000000004,6.1021268196397749,1.8086373693691957,8.1355000000000004E-3,-4.8115180773849007,-2.0896157505860056,null,null,null,null,null,null,null,198.14999999999998,1.3882641796784636,13882.641796784636,4.1424721180348705]
[null,5,278.14999999999998,4.9499999999999886,8.7257999999999996,6.544888230940046,1.8786843222015415,8.7258000000000006E-3,-4.7414711245525547,-2.0591947454967805,null,null,null,null,null,null,null,193.14999999999998,1.3721549476494292,13721.549476494292,4.1374031559112101]
[null,6,279.14999999999998,5.9499999999999886,9.3536000000000001,7.0157769553417237,1.9481614637067488,9.3536000000000001E-3,-4.6719939830473471,-2.0290212063226578]
[null,7,280.14999999999998,6.9499999999999886,10.021000000000001,7.5163681223784877,2.0170830588481512,1.0021E-2,-4.6030723879059456,-1.9990889378687766]
[null,8,281.14999999999998,7.9499999999999886,10.73,8.0481618554157439,2.0854437244145663,1.073E-2,-4.5347117223395301,-1.9694002780340489]
[null,9,282.14999999999998,8.9499999999999886,11.483000000000001,8.6129583024919842,2.1532678485660113,1.1483E-2,-4.4668875981880847,-1.9399446351751553]
[null,10,283.14999999999998,9.9499999999999886,12.282,9.2122575869726155,2.2205349436791666,1.2282E-2,-4.3996205030749298,-1.9107309069538507]
[null,11,284.14999999999998,10.949999999999989,13.13,9.8483098939057516,2.2872998560866638,1.3130000000000001E-2,-4.3328555906674318,-1.8817352739105206]
[null,12,285.14999999999998,11.949999999999989,14.028,10.521865284974096,2.3534555000498907,1.4028000000000001E-2,-4.2666999467042057,-1.8530042427905351]
[null,13,286.14999999999998,12.949999999999989,14.981,11.236674068591171,2.419182899307204,1.4981E-2,-4.2009725474468924,-1.8244591959832321]
[null,14,287.14999999999998,13.949999999999989,15.99,11.993486306439678,2.484363694617822,1.5990000000000001E-2,-4.1357917521362744,-1.7961515362537652]
[null,15,288.14999999999998,14.949999999999989,17.058,12.794552183567731,2.549019469668877,1.7058E-2,-4.0711359770852189,-1.7680718899259142]
[null,16,289.14999999999998,15.949999999999989,18.187999999999999,13.642121885023442,2.6131622037347233,1.8187999999999999E-2,-4.0069932430193731,-1.7402150544669295]
[null,17,290.14999999999998,16.949999999999989,19.384,14.539195657537631,2.6768481512861837,1.9384000000000002E-2,-3.9433072954679123,-1.7125565988705502]
[null,18,291.14999999999998,17.949999999999989,20.646999999999998,15.486523562792996,2.7399701981747016,2.0646999999999999E-2,-3.8801852485793948,-1.6851430422204288]
[null,19,292.14999999999998,18.949999999999989,21.983000000000001,16.488605970885768,2.802669595149939,2.1983000000000003E-2,-3.817485851604157,-1.6579130400954214]
[null,20,293.14999999999998,19.949999999999989,23.393000000000001,17.546192943498649,2.8648370000835892,2.3393000000000001E-2,-3.7553184466705067,-1.6309140791784922]
[null,21,294.14999999999998,20.949999999999989,24.882000000000001,18.66303478904516,2.9265448182642584,2.4882000000000001E-2,-3.6936106284898376,-1.6041147142523384]
[null,22,295.14999999999998,21.949999999999989,26.452999999999999,19.841381692573407,2.9877697411946245,2.6453000000000001E-2,-3.6323857055594719,-1.5775250680687287]
[null,23,296.14999999999998,22.949999999999989,28.111000000000001,21.084983962496921,3.0485611265862786,2.8111000000000001E-2,-3.5715943201678177,-1.5511237048458792]
[null,24,297.14999999999998,23.949999999999989,29.858000000000001,22.395341722181108,3.1088529784033576,2.9858000000000003E-2,-3.5113024683507388,-1.5249392862979934]
[null,25,298.14999999999998,24.949999999999989,31.699000000000002,23.776205280039484,3.168685302416292,3.1699000000000005E-2,-3.4514701443378044,-1.4989544381397284]
[null,26,299.14999999999998,25.949999999999989,33.639000000000003,25.231324944485575,3.2280862759188125,3.3639000000000002E-2,-3.3920691708352835,-1.4731569231279025]
[null,27,300.14999999999998,26.949999999999989,35.680999999999997,26.762950900567485,3.287018501996851,3.5680999999999997E-2,-3.3331369447572454,-1.4475629825359355]
[null,28,301.14999999999998,27.949999999999989,37.831000000000003,28.375583518381454,3.3455290401145765,3.7831000000000004E-2,-3.2746264066395199,-1.4221521786982174]
[null,29,302.14999999999998,28.949999999999989,40.091999999999999,30.071472982975582,3.4035769809345791,4.0092000000000003E-2,-3.2165784658195173,-1.3969422783142438]
[null,30,303.14999999999998,29.949999999999989,42.47,31.855119664446097,3.4611981120971387,4.2470000000000001E-2,-3.1589573346569573,-1.3719177390093205]
[null,31,304.14999999999998,30.949999999999989,44.969000000000001,33.729523809523819,3.5183735312604081,4.4969000000000002E-2,-3.1017819154936879,-1.3470867699662072]
[null,32,305.14999999999998,31.949999999999989,47.595999999999997,35.699935849987668,3.575148891864866,4.7595999999999999E-2,-3.04500655488923,-1.3224295441476239]
[null,33,306.14999999999998,32.949999999999989,50.250999999999998,37.691349617567241,3.6294306150106443,5.0250999999999997E-2,-2.9907248317434516,-1.2988552913172124]
[null,34,307.14999999999998,33.949999999999989,53.250999999999998,39.941534665679754,3.6874167515278868,5.3251E-2,-2.9327386952262091,-1.2736722322008853]
[null,35,308.14999999999998,34.949999999999989,56.29,42.220972119417723,3.7429170672478942,5.629E-2,-2.8772383795062018,-1.2495687513397977]
[null,36,309.14999999999998,35.949999999999989,59.497,44.626419935850002,3.7983260588843364,5.9497000000000001E-2,-2.8218293878697596,-1.2255049320242675]
[null,37,310.14999999999998,36.949999999999989,62.823,47.121125092524068,3.8527214162340839,6.2823000000000004E-2,-2.767434030520012,-1.2018813284861167]
[null,38,311.14999999999998,37.949999999999989,66.328000000000003,49.750091290402189,3.9070122985858768,6.6327999999999998E-2,-2.7131431481682196,-1.1783030978630744]
[null,39,312.14999999999998,38.949999999999989,70.001999999999995,52.505817912657299,3.9609239808417338,7.0001999999999995E-2,-2.6592314659123621,-1.1548895517492341]
[null,40,313.14999999999998,39.949999999999989,73.849000000000004,55.391305206020249,4.0144226356962598,7.3849000000000012E-2,-2.6057328110578362,-1.131655381156667]
[null,41,314.14999999999998,40.949999999999989,77.878,58.413303725635345,4.0675436674120524,7.7878000000000003E-2,-2.552611779342044,-1.1085852102094906]
[null,42,315.14999999999998,41.949999999999989,82.096000000000004,61.577063903281541,4.1202894619715682,8.2096000000000002E-2,-2.4998659847825282,-1.0856780026886905]
[null,43,316.14999999999998,42.949999999999989,86.507999999999996,64.886336047372325,4.1726370629824006,8.6508000000000002E-2,-2.4475183837716954,-1.0629437284288126]
[null,44,317.14999999999998,43.949999999999989,91.123999999999995,68.348620774734783,4.2246213841036671,9.1123999999999997E-2,-2.3955340626504289,-1.0403672246203599]
[null,45,318.14999999999998,44.949999999999989,95.95,71.968418455465113,4.2762273902256682,9.5950000000000008E-2,-2.3439280565284282,-1.0179550209285095]
[null,46,319.14999999999998,45.949999999999989,100.99,75.748729336294119,4.3274216698104242,0.10099,-2.2927337769436718,-0.99572162779983753]
[null,47,320.14999999999998,46.949999999999989,106.27,79.709055020972144,4.3783831931565631,0.10627,-2.2417722535975333,-0.97358931942122595]
[null,48,321.14999999999998,47.949999999999989,111.77,83.834394275845071,4.4288433561694793,0.11176999999999999,-2.1913120905846171,-0.9516747490687778]
[null,49,322.14999999999998,48.949999999999989,117.52,88.147248951394047,4.4790086996375811,0.11752,-2.1411467471165153,-0.92988821721779991]
[null,50,323.14999999999998,49.949999999999989,123.52,92.647619047619074,4.5288032540484249,0.12352,-2.0913521927056711,-0.90826271700833905]
[null,51,324.14999999999998,50.949999999999989,129.78,97.343005181347181,4.5782408769649816,0.12978000000000001,-2.0419145697891148,-0.88679223017726483]
[null,52,325.14999999999998,51.949999999999989,136.31,102.24090796940541,4.6273318713547109,0.13631000000000001,-1.9928235753993853,-0.86547228220266192]
[null,53,326.14999999999998,52.949999999999989,143.12,107.3488280286208,4.6760836069724228,0.14312,-1.9440718397816734,-0.84429967244068338]
[null,54,327.14999999999998,53.949999999999989,150.22,112.6742659758204,4.7245010540298251,0.15021999999999999,-1.8956543927242713,-0.82327224235581087]
[null,55,328.15,54.949999999999989,157.62,118.22472242783127,4.7725872406974625,0.15762000000000001,-1.8475682060566334,-0.80238867683028603]
[null,56,329.15,55.949999999999989,165.33,124.00769800148042,4.820343644335213,0.16533,-1.7998118024188834,-0.78164833425486679]
[null,57,330.15,56.949999999999989,173.36,130.03069331359492,4.8677705250000631,0.17336000000000001,-1.7523849217540333,-0.76105110168823842]
[null,58,331.15,57.949999999999989,181.71,136.29370836417473,4.9148121774329248,0.18171000000000001,-1.7053432693211714,-0.74062117161703578]
[null,59,332.15,58.949999999999989,190.41,142.81924500370098,4.9615798097584474,0.19041,-1.6585756369956486,-0.72031024696638113]
[null,60,333.15,59.949999999999989,199.46,149.60730323217373,5.008013882745681,0.19946,-1.6121415640084151,-0.70014418529573275]
[null,61,334.15,60.949999999999989,208.88,156.67288428324701,5.0541600921628325,0.20888000000000001,-1.5659953545912635,-0.68010314118511195]
[null,62,335.15,61.949999999999989,218.67,164.01598815692083,5.0999639118341902,0.21867,-1.5201915349199058,-0.66021079505174962]
[null,63,336.15,62.949999999999989,228.85,171.65161608684929,5.1454669348716102,0.22885,-1.474688511882486,-0.6404490832366817]
[null,64,{"$f":"B160+273.15","v":337.15},{"$f":"C160-273.2","v":63.949999999999989},239.43,{"$f":"E160*0.75006168270417","v":179.58726868985943},{"$f":"LN(F160)","v":5.1906612663279867},{"$f":"E160*0.001","v":0.23943},{"$f":"LN(H160)","v":-1.4294941804261099},{"$f":"LOG(H160)","v":-0.62082143447187099}]
[null,65,338.15,64.949999999999989,250.42,187.83044658277822,5.2355396760127606,0.25041999999999998,-1.3846157707413356,-0.60133098878918001]
[null,66,339.15,65.949999999999989,261.83,196.38865038243281,5.2800956059737398,0.26183000000000001,-1.3400598407803561,-0.58198059427105886]
[null,67,340.15,66.949999999999989,273.69,205.28438193930427,5.3243962467974519,0.27368999999999999,-1.2957591999566445,-0.56274107041654298]
[null,68,341.15,67.949999999999989,285.99,214.51014063656558,5.3683570129455553,0.28599000000000002,-1.2517984338085406,-0.54364915225818222]
[null,69,342.15,68.949999999999989,298.76,224.08842832469782,5.4120407432608246,0.29875999999999997,-1.2081147034932713,-0.52467754923331089]
[null,70,343.15,69.949999999999989,312.01,234.02674562052806,5.4554354063498618,0.31201000000000001,-1.1647200404042348,-0.50583148650969167]
[null,71,344.15,70.949999999999989,325.75,244.33259314088338,5.4985303837769139,0.32574999999999998,-1.1216250629771827,-0.48711557561537772]
[null,72,345.15,71.949999999999989,340,255.02097211941779,5.5413457853821662,0.34,-1.0788096613719298,-0.46852108295774486]
[null,73,346.15,72.949999999999989,354.78,266.1068837897854,5.5838980468327524,0.35477999999999998,-1.0362573999213436,-0.45004087061725073]
[null,74,347.15,73.949999999999989,370.09,277.59032815198623,5.6261463870746313,0.37008999999999997,-0.99400905967946496,-0.43169264958063175]
[null,75,348.15,74.949999999999989,385.95,289.48630643967437,5.6681079951678219,0.38595000000000002,-0.95204745158627413,-0.41346895473397216]
[null,76,349.15,75.949999999999989,402.39,301.81732050333096,5.7098219353540678,0.40238999999999997,-0.91033351140002849,-0.39535282069264338]
[null,77,350.15,76.949999999999989,419.41,314.58337034295596,5.7512491295416002,0.41941000000000006,-0.86890631721249578,-0.37736121885626345]
[null,78,351.15,77.949999999999989,437.03,327.79945719220336,5.7924020103968372,0.43702999999999997,-0.82775343635725895,-0.35948874978641215]
[null,79,352.15,78.949999999999989,455.27,341.48058228472746,5.8332908173202451,0.45527000000000001,-0.78686462943385116,-0.34173096656796864]
[null,80,353.15,79.949999999999989,474.14,355.63424623735511,5.8739028045070452,0.47414000000000001,-0.74625264224705068,-0.32409340463361563]
[null,81,354.15,80.949999999999989,493.67,370.28295090056758,5.9142674455433157,0.49367000000000005,-0.70588800121078066,-0.30656326376755799]
[null,82,355.15,81.949999999999989,513.87,385.43419689119179,5.9543704829499626,0.51387000000000005,-0.66578496380413366,-0.28914673591429152]
[null,83,356.15,82.949999999999989,534.76,401.1029854428819,5.9942182158868809,0.53476000000000001,-0.6259372308672152,-0.27184108538343338]
[null,84,357.15,83.949999999999989,556.35,417.29681717246496,6.033797760375669,0.55635000000000001,-0.58635768637842756,-0.25465190761570861]
[null,85,358.15,84.949999999999989,578.66999999999996,434.03819393042198,6.0731325346762173,0.57867000000000002,-0.54702291207787845,-0.23756903219007031]
[null,86,359.15,85.949999999999989,601.73,451.33461633358019,6.1122090074889481,0.60172999999999999,-0.50794643926514815,-0.22059833567525911]
[null,87,360.15,86.949999999999989,625.55999999999995,469.20858623242049,6.1510474163399742,0.62556,-0.46910803041412219,-0.20373102902535609]
[null,88,361.15,87.949999999999989,650.16999999999996,487.66760424377014,6.189634034927959,0.65017000000000003,-0.43052141182613707,-0.18697307349728873]
[null,89,362.15,88.949999999999989,675.58,506.72667160128316,6.2279717489518456,0.67558000000000007,-0.3921836978022501,-0.17032321584792967]
[null,90,363.15,89.949999999999989,701.82,526.40829015544057,6.26607712866263,0.70182000000000011,-0.35407831809146623,-0.15377425970870814]
[null,91,364.15,90.949999999999989,728.9,546.71996052306952,6.3039367161601261,0.72889999999999999,-0.31621873059396982,-0.13733204977141208]
[null,92,365.15,91.949999999999989,756.84,567.67668393782401,6.3415520382355197,0.75684000000000007,-0.27860340851857679,-0.12099592295905533]
[null,93,366.15,92.949999999999989,785.68,589.30846286701217,6.3789497526214776,0.78567999999999993,-0.24120569413261833,-0.10475430196543971]
[null,94,367.15,93.949999999999989,815.41,611.60779669380724,6.4160912220014596,0.81540999999999997,-0.20406422475263661,-8.8623966763935053E-2]
[null,95,368.15,94.949999999999989,846.08,634.61218850234411,6.4530140855551714,0.84608000000000005,-0.16714136119892489,-7.258857086649137E-2]
[null,96,369.15,95.949999999999989,877.71,658.33663952627705,6.4897164107197334,0.8777100000000001,-0.1304390360343631,-5.6648953574503322E-2]
[null,97,370.15,96.949999999999989,910.3,682.78114976560585,6.5261743832832018,0.9103,-9.3981063470893952E-2,-4.0815457268808517E-2]
[null,98,371.15,97.949999999999989,943.9,707.98322230446604,6.5624203961028575,0.94389999999999996,-5.7735050651238372E-2,-2.5074013910237569E-2]
[null,99,372.15,98.949999999999989,978.52,733.95035775968438,6.5984413938473425,0.97852000000000006,-2.1714052906753847E-2,-9.4302933571584618E-3]
[null,100,373.15,99.949999999999989,1013.3,760.03750308413532,6.6333677782262308,1.0132999999999999,1.3212331472134681E-2,5.7380426514247601E-3]
[null,101,374.15,100.94999999999999,1050,787.56476683937842,6.6689456109235286,1.05,4.8790164169432049E-2,2.1189299069938092E-2]
[null,102,375.15,101.94999999999999,1087.7,815.84209227732572,6.7042208218717638,1.0877000000000001,8.4065375117667637E-2,3.6509128532729987E-2]
[null,103,376.15,102.94999999999999,1126.7,845.09449790278836,6.7394484529420797,1.1267,0.11929300618798321,5.180829431709158E-2]
[null,104,377.15,103.94999999999999,1166.7,875.09696521095509,6.7743346976017706,1.1667000000000001,0.15417925084767431,6.6959197867122205E-2]
[null,105,378.15,104.94999999999999,1208,906.07451270663728,6.8091215462667192,1.208,0.18896609951262316,8.2066934285113011E-2]
[null,106,379.15,105.94999999999999,1250.5,937.95213422156451,6.8436989180896326,1.2504999999999999,0.22354347133553665,9.7083696066521313E-2]
[null,107,380.15,106.94999999999999,1294,970.57981741919593,6.877893642832805,1.294,0.25773819607870885,0.11193427633268159]
[null,108,381.15,107.94999999999999,1339.12,1004.422600542808,6.9121681285663232,1.3391199999999999,0.29201268181222739,0.12681949635682041]
[null,109,382.15,108.94999999999999,1385.11,1038.9179373303728,6.9459350056222791,1.3851099999999998,0.32577955886818272,0.14148426473332734]
[null,110,383.15,109.94999999999999,1432.63,1074.560868492475,6.9796673626795824,1.4326300000000001,0.35951191592548609,0.15613404126490441]
[null,111,384.15,110.94999999999999,1481.48,1111.2013816925737,7.0131970348632038,1.4814800000000001,0.39304158810910733,0.17069579287427605]
[null,112,385.15,111.94999999999999,1531.53,1148.7419689119174,7.0464226824915235,1.5315300000000001,0.42626723573742764,0.18512550829691746]
[null,113,386.15,112.94999999999999,1583.1,1187.4226498889714,7.0795403968516908,1.5831,0.45938495009759478,0.19950834889678612]
[null,114,387.15,113.94999999999999,1636.2,1227.250925240563,7.112531926851557,1.6362000000000001,0.49237648009746082,0.21383638832527355]
[null,115,388.15,114.94999999999999,1690.5,1267.9792746113992,7.1451797899198999,1.6905000000000001,0.52502434316580371,0.22801517510178781]
[null,120,393.15,119.94999999999999,1985.36,1489.1424623735509,7.3059557046509882,1.98536,0.68580025789689192,0.29783926769244712]
[null,125,398.15,124.94999999999999,2321.0500000000002,1740.9306686405139,7.4621751162529657,2.3210500000000001,0.84201966949886908,0.36568449611735865]
[null,130,403.15,129.94999999999999,2701.24,2026.096619787812,7.613866373596383,2.7012399999999999,0.99371092684228668,0.43156317213457107]
[null,135,408.15,134.94999999999999,3129.42,2347.2580310880835,7.7610031306209635,3.1294200000000001,1.1408476838668675,0.49546385379548602]
[null,140,413.15,139.94999999999999,3614.26,2710.9179373303737,7.9050425787824423,3.6142600000000003,1.2848871320283464,0.55801939130840583]
[null,145,418.15,144.94999999999999,4155.34,3116.7613126079455,8.044549700835228,4.1553399999999998,1.4243942540811318,0.61860656460213403]
[null,150,423.15,149.94999999999999,4760.25,3570.481125092525,8.1804556346266484,4.7602500000000001,1.5603001878725522,0.67762976170565647]
[null,175,448.15,174.95,8924.7099999999991,6694.0830002467319,8.8089792808946914,8.9247099999999993,2.188823834140595,0.95059411302557884]
[null,200,473.15,199.95,15544.27,11659.161312607948,9.3638475287246976,15.544270000000001,2.7436920819706017,1.1915703312414767]
[null,225,498.15,224.95,25495.4,19123.122625215896,9.858653490488992,25.495400000000004,3.2384980437348956,1.4064618300485412]
[null,250,523.15,249.95,39753.85,29817.839624969165,10.302862138510173,39.75385,3.6827066917560769,1.599379194697844]
[null,275,548.15,274.95,59436.23,44580.838687392068,10.705059419849304,59.436230000000002,4.0849039730952077,1.7740512546199183]
[null,300,{"$f":"B224+273.15","v":573.15},{"$f":"C224-273.2","v":299.95},85903.3,{"$f":"E224*0.75006168270417","v":64432.773747841122},{"$f":"LN(F224)","v":11.07337769177008},{"$f":"E224*0.001","v":85.903300000000002},{"$f":"LN(H224)","v":4.4532222450159837},{"$f":"LOG(H224)","v":1.9340098476992524}]
[null,325,598.15,324.95,120587,90447.688132247742,11.412526930875426,120.587,4.7923714841213298,2.0813004907843911]
[null,350,623.15,349.95,165321.9,124001.62250185051,11.728049929193913,165.3219,5.1078944824398169,2.2183303878676788]
[null,360,633.15,359.95,186508.9,139893.17937330375,11.848634405878972,186.50890000000001,5.2284789591248755,2.2706995606951912]
[null,365,638.15,364.95,198009.3,148519.18874907479,11.90846944604256,198.0093,5.2883139992884631,2.2966855884626969]
[null,366,639.15,365.95,200410.7,150320.38687392059,11.920524207753012,200.41070000000002,5.3003687609989161,2.3019209049542049]
[null,367,640.15,366.95,202822.3,152129.23562792997,11.932485672978174,202.82229999999998,5.3123302262240779,2.3071157032969705]
[null,368,641.15,367.95,205264.2,153960.8112509253,11.944453376615582,205.26420000000002,5.324297929861487,2.3123132109477504]
[null,369,642.15,368.95,207736.5,155815.18874907479,11.956425896428776,207.73650000000001,5.3362704496746804,2.3175128102370981]
[null,370,643.15,369.95,210239.2,157692.36812237854,11.968401376868064,210.23920000000001,5.3482459301139684,2.3227136953100209]
[null,371,644.15,370.95,212762.2,159584.77374784116,11.980330556864281,212.76220000000001,5.3601751101101849,2.3278944723560082]
[null,372,645.15,371.95,215325.8,161507.63187762155,11.992307676736491,215.32579999999999,5.3721522299823956,2.3330960694256033]
[null,373,646.15,372.95,217939.9,163468.36812237854,12.004374783460849,217.93989999999999,5.3842193367067521,2.3383367472885288]
[null,373.94600000000003,647.096,{"$f":"C237-273.2","v":373.89600000000002},220584.5,165451.98124845797,12.016436288185632,220.58449999999999,5.3962808414315369,2.343574992233953]